{"text_format":"3","workbook":"xlsx","n_sheets":5,"sheets":["Aussenlärm","Innenlärm","Konstruktion","Kurzinformation","Beispiele"],"not_rendered":{"images":12,"defined_names":4,"comments":3},"read":"whole","date_system":"1900"}

{"sheet":"Aussenlärm","index":0,"n_rows":53,"n_cols":103,"rows_kept":53,"merged":[[0,0,0,107],[1,0,1,2],[1,50,3,57],[1,58,3,107],[4,0,4,13],[4,14,4,52],[4,54,4,64],[4,65,4,77],[4,78,4,88],[4,89,4,107],[5,0,5,13],[5,14,5,107],[6,0,6,107],[7,0,7,107],[8,0,8,107],[9,0,9,2],[9,3,9,24],[9,25,9,30],[9,31,9,45],[9,46,9,51],[9,52,9,65],[9,66,9,107],[10,0,10,2],[10,3,10,24],[10,25,10,30],[10,31,10,45],[10,46,10,51],[10,52,10,65],[10,66,10,107],[11,0,11,2],[11,3,11,24],[11,25,11,30],[11,31,11,45],[11,46,11,51],[11,52,11,64],[11,66,11,107],[12,0,12,2],[12,3,12,10],[12,11,12,107],[13,0,13,2],[13,3,13,45],[13,46,13,107],[14,0,14,107],[15,0,15,107],[16,0,16,56],[16,57,16,60],[16,61,16,107],[17,0,17,107],[18,0,18,15],[18,16,18,35],[18,36,18,59],[18,60,18,83],[18,84,18,107],[19,0,19,15],[19,16,19,35],[19,36,19,59],[19,60,19,83],[19,84,19,107],[20,16,20,35],[20,36,20,59],[20,60,20,83],[20,84,20,107],[21,0,21,35],[21,36,21,43],[21,44,21,47],[21,48,21,55],[21,56,21,59],[21,60,21,67],[21,68,21,71],[21,72,21,79],[21,80,21,83],[21,84,21,91],[21,92,21,95],[21,96,21,103],[21,104,21,107],[22,0,22,35],[22,36,22,59],[22,60,22,83],[22,84,22,107],[23,0,23,35],[23,36,23,44],[23,45,23,50],[23,51,23,59],[23,60,23,68],[23,69,23,74],[23,75,23,83],[23,84,23,92],[23,93,23,98],[23,99,23,107],[24,0,24,35],[24,36,24,43],[24,44,24,51],[24,52,24,59],[24,60,24,67],[24,68,24,75],[24,76,24,83],[24,84,24,91],[24,92,24,99],[24,100,24,107],[25,0,25,35],[25,36,25,43],[25,44,25,51],[25,52,25,59],[25,60,25,67],[25,68,25,75],[25,76,25,83],[25,84,25,91],[25,92,25,99],[25,100,25,107],[26,0,26,35],[26,36,26,43],[26,44,26,51],[26,52,26,59],[26,60,26,67],[26,68,26,75],[26,76,26,83],[26,84,26,91],[26,92,26,99],[26,100,26,107],[27,0,27,35],[27,36,27,43],[27,44,27,51],[27,52,27,59],[27,60,27,67],[27,68,27,75],[27,76,27,83],[27,84,27,91],[27,92,27,99],[27,100,27,107],[28,0,28,35],[28,36,28,43],[28,44,28,51],[28,52,28,59],[28,60,28,67],[28,68,28,75],[28,76,28,83],[28,84,28,91],[28,92,28,99],[28,100,28,107],[29,0,29,35],[29,36,29,43],[29,44,29,51],[29,52,29,59],[29,60,29,67],[29,68,29,75],[29,76,29,83],[29,84,29,91],[29,92,29,99],[29,100,29,107],[30,0,30,35],[30,36,30,43],[30,44,30,51],[30,52,30,59],[30,60,30,67],[30,68,30,75],[30,76,30,83],[30,84,30,91],[30,92,30,99],[30,100,30,107],[31,0,31,35],[31,36,31,43],[31,44,31,51],[31,52,31,59],[31,60,31,67],[31,68,31,75],[31,76,31,83],[31,84,31,91],[31,92,31,99],[31,100,31,107],[32,0,32,35],[32,36,32,43],[32,44,32,51],[32,52,32,59],[32,60,32,67],[32,68,32,75],[32,76,32,83],[32,84,32,91],[32,92,32,99],[32,100,32,107],[33,0,33,35],[33,36,33,43],[33,44,33,59],[33,60,33,67],[33,68,33,83],[33,84,33,91],[33,92,33,107],[34,0,34,35],[34,36,34,43],[34,44,34,51],[34,52,34,59],[34,60,34,67],[34,68,34,75],[34,76,34,83],[34,84,34,91],[34,92,34,99],[34,100,34,107],[35,0,35,35],[35,36,35,43],[35,44,35,51],[35,52,35,59],[35,60,35,67],[35,68,35,75],[35,76,35,83],[35,84,35,91],[35,92,35,99],[35,100,35,107],[36,0,36,35],[36,36,36,43],[36,44,36,52],[36,53,36,59],[36,60,36,67],[36,68,36,76],[36,77,36,83],[36,84,36,91],[36,92,36,100],[36,101,36,107],[37,0,37,35],[37,36,37,43],[37,44,37,52],[37,53,37,59],[37,60,37,67],[37,68,37,76],[37,77,37,83],[37,84,37,91],[37,92,37,100],[37,101,37,107],[38,0,38,107],[39,0,39,107],[40,0,40,107],[41,0,41,90],[41,91,41,94],[41,95,41,97],[41,98,41,101],[41,102,41,107],[43,0,43,20],[43,21,43,22],[43,23,43,62],[43,63,43,64],[43,65,43,66],[43,67,43,107],[44,0,45,20],[44,21,44,22],[44,23,44,62],[44,63,44,64],[44,65,44,66],[44,67,44,107],[45,21,45,22],[45,23,45,62],[45,63,45,64],[45,65,45,66],[45,67,45,107],[46,0,46,20],[46,21,46,22],[46,23,46,62],[46,63,46,64],[46,65,46,66],[46,67,46,107],[47,0,47,20],[47,21,47,22],[47,23,47,62],[47,63,47,64],[47,65,47,66],[47,67,47,107],[48,0,48,20],[48,21,48,22],[48,23,48,62],[48,63,48,64],[48,65,48,66],[48,67,48,107],[49,0,49,20],[49,21,49,22],[49,23,49,62],[49,63,49,64],[49,65,49,66],[49,67,49,88],[49,89,49,92],[49,93,49,107],[50,0,50,20],[50,21,50,22],[50,23,50,62],[50,63,50,64],[50,65,50,66],[50,67,50,73],[50,74,50,107],[51,0,51,107],[52,0,52,13],[52,14,52,16],[52,17,52,20],[52,21,52,23],[52,24,52,44],[52,45,52,82],[52,83,52,107]]}
[]
[{"$nulls":3},"Schallschutz SIA-Norm 181 (2020) ",{"$nulls":46},"S",{"$nulls":7},"Schallschutznachweis\nAussenlärm"]
[{"$nulls":21},"Projektkontrolle"]
[]
["Gemeinde:",{"$nulls":53},"Parz. Nr.:",{"$nulls":23},"Geb. Nr.:"]
["Bauvorhaben:"]
[]
[]
["Aussenlärmsituation (Beurteilungspegel)"]
[{"$nulls":3},"Strassenlärm:",{"$nulls":27},"dB (Tag)",{"$nulls":20},"dB (Nacht)"]
[{"$nulls":3},"Eisenbahnlärm:",{"$nulls":27},"dB (Tag)",{"$nulls":20},"dB (Nacht)"]
[{"$nulls":3},"Fluglärm:",{"$nulls":27},"dB (6-22 h)",{"$nulls":20},"dB (22-23 h)"]
[{"$nulls":3},"andere:"]
[{"$nulls":3},"keine spezifische Lärmquelle vorhanden"]
[]
[]
["Schutz gegen Aussenlärm",{"$nulls":60},"Siehe beiliegenden Schallschutznachweis"]
[]
["Situation"]
["Empfangsraum: ",{"$nulls":15},"Bezeichnung"]
["                        ",{"$nulls":15},"Nr. / Geschoss"]
["Massgebende Lärmbelastung",{"$nulls":35},"Lr,Tag =",{"$nulls":11},"Lr,Nacht =",{"$nulls":11},"Lr,Tag =",{"$nulls":11},"Lr,Nacht =",{"$nulls":11},"Lr,Tag =",{"$nulls":11},"Lr,Nacht ="]
["Lärmempfindlichkeit"]
["Massgebende Anforderung ",{"$nulls":35},"De =",{"$nulls":14},"dB",{"$nulls":8},"De =",{"$nulls":14},"dB",{"$nulls":8},"De =",{"$nulls":14},"dB"]
["Trennbauteile",{"$nulls":35},"S [m2]",{"$nulls":7},"R'45°,w",{"$nulls":7},"Ctr [dB]",{"$nulls":7},"S [m2]",{"$nulls":7},"R'45°,w",{"$nulls":7},"Ctr [dB]",{"$nulls":7},"S [m2]",{"$nulls":7},"R'45°,w",{"$nulls":7},"Ctr [dB]"]
{"$rows_empty":8}
["Sres und (R'45°,w + Ctr)res",{"$nulls":35},{"$f":"SUM(AK26:AR33)","v":{"v":0,"d":"0.0"}},{"$nulls":7},{"$f":"IF(AK34>0,ROUND(-10*LOG(\n(AK26*10^((ROUND(-AS26-BA26,1))/10)\n+AK27*10^((ROUND(-AS27-BA27,1))/10)\n+AK28*10^((ROUND(-AS28-BA28,1))/10)\n+AK29*10^((ROUND(-AS29-BA29,1))/10)\n+AK30*10^((ROUND(-AS30-BA30,1))/10)\n+AK31*10^((ROUND(-AS31-BA31,1))/10)\n+AK32*10^((ROUND(-AS32-BA32,1))/10)\n+AK33*10^((ROUND(-AS33-BA33,1))/10)\n)/AK34),1),0)","v":{"v":0,"d":"0.0"}},{"$nulls":15},{"$f":"SUM(BI26:BP33)","v":{"v":0,"d":"0.0"}},{"$nulls":7},{"$f":"IF(BI34>0,ROUND(-10*LOG(\n(BI26*10^((ROUND(-BQ26-BY26,1))/10)\n+BI27*10^((ROUND(-BQ27-BY27,1))/10)\n+BI28*10^((ROUND(-BQ28-BY28,1))/10)\n+BI29*10^((ROUND(-BQ29-BY29,1))/10)\n+BI30*10^((ROUND(-BQ30-BY30,1))/10)\n+BI31*10^((ROUND(-BQ31-BY31,1))/10)\n+BI32*10^((ROUND(-BQ32-BY32,1))/10)\n+BI33*10^((ROUND(-BQ33-BY33,1))/10)\n)/BI34),1),0)","v":{"v":0,"d":"0.0"}},{"$nulls":15},{"$f":"SUM(CG26:CN33)","v":{"v":0,"d":"0.0"}},{"$nulls":7},{"$f":"IF(CG34>0,ROUND(-10*LOG(\n(CG26*10^((ROUND(-CO26-CW26,1))/10)\n+CG27*10^((ROUND(-CO27-CW27,1))/10)\n+CG28*10^((ROUND(-CO28-CW28,1))/10)\n+CG29*10^((ROUND(-CO29-CW29,1))/10)\n+CG30*10^((ROUND(-CO30-CW30,1))/10)\n+CG31*10^((ROUND(-CO31-CW31,1))/10)\n+CG32*10^((ROUND(-CO32-CW32,1))/10)\n+CG33*10^((ROUND(-CO33-CW33,1))/10)\n)/CG34),1),0)","v":{"v":0,"d":"0.0"}}]
["Volumen Empfangsraum",{"$nulls":35},"V =",{"$nulls":15},"m3",{"$nulls":7},"V =",{"$nulls":15},"m3",{"$nulls":7},"V =",{"$nulls":15},"m3"]
["Projektierungszuschlag Kp",{"$nulls":35},"Kp =",{"$nulls":7},{"v":2,"d":"2.0"},{"$nulls":7},"dB",{"$nulls":7},"Kp =",{"$nulls":7},{"v":2,"d":"2.0"},{"$nulls":7},"dB",{"$nulls":7},"Kp =",{"$nulls":7},{"v":2,"d":"2.0"},{"$nulls":7},"dB"]
["Ermittelter Schallschutz",{"$nulls":35},"De,d =",{"$nulls":7},{"$f":"IF(AND(AK34>0,AS34>0,AS35>0),ROUND(AS34+10*LOG(AS35/AK34)-4.9-AS36,1),0)","v":{"v":0,"d":"0.0"}},{"$nulls":8},"dB",{"$nulls":6},"De,d =",{"$nulls":7},{"$f":"IF(AND(BI34>0,BQ34>0,BQ35>0),ROUND(BQ34+10*LOG(BQ35/BI34)-4.9-BQ36,1),0)","v":{"v":0,"d":"0.0"}},{"$nulls":8},"dB",{"$nulls":6},"De,d =",{"$nulls":7},{"$f":"IF(AND(CG34>0,CO34>0,CO35>0),ROUND(CO34+10*LOG(CO35/CG34)-4.9-CO36,1),0)","v":{"v":0,"d":"0.0"}},{"$nulls":8},"dB"]
["Erfüllt ",{"$nulls":43},{"$f":"IF(AND(AT24>0,AS37>0),IF(AND(AT24<=AS37,AS34>=AT24-5),\"Ja\",\"Nein\"),\"\")","v":""},{"$nulls":23},{"$f":"IF(AND(BR24>0,BQ37>0),IF(AND(BR24<=BQ37,BQ34>=BR24-5),\"Ja\",\"Nein\"),\"\")","v":""},{"$nulls":23},{"$f":"IF(AND(CP24>0,CO37>0),IF(AND(CP24<=CO37,CO34>=CP24-5),\"Ja\",\"Nein\"),\"\")","v":""}]
[]
["Unterschriften:"]
["Das Projekt erfüllt Anforderungen der SIA-Norm 181:2020 gemäss Art. 32 LSV (Aussenlärm, Innenlärm, gebäudetech-"]
["nische Anlagen):",{"$nulls":94},"ja",{"$nulls":6},"nein"]
[]
[{"$nulls":23},"Nachweis erarbeitet durch:",{"$nulls":43},"Private Kontrolle / Nachweisprüfung:\nDie Vollständigkeit und die Richtigkeit\nbescheinigt:"]
["Name und Adresse,\nbzw. Firmenstempel:"]
[]
[]
["Sachbearbeiter/in, Tel.:"]
["Ort, Datum, Unterschrift:"]
[{"$nulls":67},"Ausführungskontrolle:",{"$nulls":25},"gleiche Person"]
[{"$nulls":67},"oder :"]
[]
["Formular S Seite ",{"$nulls":13},1,null,null,"von",{"$nulls":3},3,{"$nulls":23},"Formular S",{"$nulls":37},"Version vom 30. November 2020"]

{"sheet":"Innenlärm","index":1,"n_rows":62,"n_cols":104,"rows_kept":62,"merged":[[0,0,0,107],[1,0,1,2],[1,50,3,57],[1,58,3,107],[4,0,4,3],[4,4,4,107],[5,0,5,107],[6,0,6,107],[7,0,7,56],[7,57,7,60],[7,61,7,107],[8,0,8,107],[9,0,9,35],[9,36,9,59],[9,60,9,83],[9,84,9,107],[10,0,10,35],[10,36,10,59],[10,60,10,83],[10,84,10,107],[11,0,11,15],[11,16,11,35],[11,36,11,59],[11,60,11,83],[11,84,11,107],[12,16,12,35],[12,36,12,59],[12,60,12,83],[12,84,12,107],[13,0,13,15],[13,16,13,35],[13,36,13,59],[13,60,13,83],[13,84,13,107],[14,16,14,35],[14,36,14,59],[14,60,14,83],[14,84,14,107],[15,0,15,35],[15,36,15,59],[15,60,15,83],[15,84,15,107],[16,0,16,35],[16,36,16,59],[16,60,16,83],[16,84,16,107],[17,0,17,35],[17,39,17,49],[17,50,17,54],[17,55,17,59],[17,63,17,73],[17,74,17,78],[17,79,17,83],[17,87,17,97],[17,98,17,102],[17,103,17,107],[18,0,18,35],[18,39,18,59],[18,63,18,83],[18,87,18,107],[19,0,19,35],[19,36,19,44],[19,45,19,50],[19,51,19,59],[19,60,19,68],[19,69,19,74],[19,75,19,83],[19,84,19,92],[19,93,19,98],[19,99,19,107],[20,0,20,35],[20,36,20,43],[20,44,20,51],[20,52,20,59],[20,60,20,67],[20,68,20,75],[20,76,20,83],[20,84,20,91],[20,92,20,99],[20,100,20,107],[21,0,21,35],[21,36,21,43],[21,44,21,51],[21,52,21,59],[21,60,21,67],[21,68,21,75],[21,76,21,83],[21,84,21,91],[21,92,21,99],[21,100,21,107],[22,0,22,35],[22,36,22,43],[22,44,22,51],[22,52,22,59],[22,60,22,67],[22,68,22,75],[22,76,22,83],[22,84,22,91],[22,92,22,99],[22,100,22,107],[23,0,23,35],[23,36,23,43],[23,44,23,51],[23,52,23,59],[23,60,23,67],[23,68,23,75],[23,76,23,83],[23,84,23,91],[23,92,23,99],[23,100,23,107],[24,0,24,35],[24,36,24,43],[24,44,24,51],[24,52,24,59],[24,60,24,67],[24,68,24,75],[24,76,24,83],[24,84,24,91],[24,92,24,99],[24,100,24,107],[25,0,25,35],[25,36,25,43],[25,44,25,51],[25,52,25,59],[25,60,25,67],[25,68,25,75],[25,76,25,83],[25,84,25,91],[25,92,25,99],[25,100,25,107],[26,0,26,35],[26,36,26,43],[26,44,26,51],[26,52,26,59],[26,60,26,67],[26,68,26,75],[26,76,26,83],[26,84,26,91],[26,92,26,99],[26,100,26,107],[27,0,27,35],[27,36,27,43],[27,44,27,51],[27,52,27,59],[27,60,27,67],[27,68,27,75],[27,76,27,83],[27,84,27,91],[27,92,27,99],[27,100,27,107],[28,0,28,35],[28,36,28,43],[28,44,28,51],[28,52,28,59],[28,60,28,67],[28,68,28,75],[28,76,28,83],[28,84,28,91],[28,92,28,99],[28,100,28,107],[29,0,29,35],[29,36,29,43],[29,44,29,59],[29,60,29,67],[29,68,29,83],[29,84,29,91],[29,92,29,107],[30,0,30,35],[30,36,30,43],[30,44,30,51],[30,52,30,59],[30,60,30,67],[30,68,30,75],[30,76,30,83],[30,84,30,91],[30,92,30,99],[30,100,30,107],[31,0,31,35],[31,36,31,43],[31,44,31,51],[31,52,31,59],[31,60,31,67],[31,68,31,75],[31,76,31,83],[31,84,31,91],[31,92,31,99],[31,100,31,107],[32,0,32,35],[32,36,32,43],[32,44,32,52],[32,53,32,59],[32,60,32,67],[32,68,32,76],[32,77,32,83],[32,84,32,91],[32,92,32,100],[32,101,32,107],[33,0,33,35],[33,36,33,43],[33,44,33,52],[33,53,33,59],[33,60,33,67],[33,68,33,76],[33,77,33,83],[33,84,33,91],[33,92,33,100],[33,101,33,107],[34,0,34,107],[35,0,35,56],[35,57,35,60],[35,61,35,107],[36,0,36,107],[37,0,37,35],[37,36,37,59],[37,60,37,83],[37,84,37,107],[38,0,38,35],[38,36,38,59],[38,60,38,83],[38,84,38,107],[39,0,39,15],[39,16,39,35],[39,36,39,59],[39,60,39,83],[39,84,39,107],[40,16,40,35],[40,36,40,59],[40,60,40,83],[40,84,40,107],[41,0,41,15],[41,16,41,35],[41,36,41,59],[41,60,41,83],[41,84,41,107],[42,16,42,35],[42,36,42,59],[42,60,42,83],[42,84,42,107],[43,0,43,35],[43,36,43,59],[43,60,43,83],[43,84,43,107],[44,0,44,35],[44,36,44,59],[44,60,44,83],[44,84,44,107],[45,0,45,35],[46,0,46,35],[46,36,46,44],[46,45,46,50],[46,51,46,59],[46,60,46,68],[46,69,46,74],[46,75,46,83],[46,84,46,92],[46,93,46,98],[46,99,46,107],[47,0,47,35],[47,36,47,41],[47,42,47,47],[47,48,47,53],[47,60,47,65],[47,66,47,71],[47,72,47,77],[47,84,47,89],[47,90,47,95],[47,96,47,101],[48,0,48,35],[48,36,48,41],[48,42,48,47],[48,48,48,53],[48,54,48,59],[48,60,48,65],[48,66,48,71],[48,72,48,77],[48,78,48,83],[48,84,48,89],[48,90,48,95],[48,96,48,101],[48,102,48,107],[49,0,49,35],[49,36,49,41],[49,42,49,47],[49,48,49,53],[49,54,49,59],[49,60,49,65],[49,66,49,71],[49,72,49,77],[49,78,49,83],[49,84,49,89],[49,90,49,95],[49,96,49,101],[49,102,49,107],[50,0,50,35],[50,36,50,41],[50,42,50,47],[50,48,50,53],[50,54,50,59],[50,60,50,65],[50,66,50,71],[50,72,50,77],[50,78,50,83],[50,84,50,89],[50,90,50,95],[50,96,50,101],[50,102,50,107],[51,0,51,35],[51,36,51,41],[51,42,51,47],[51,48,51,53],[51,54,51,59],[51,60,51,65],[51,66,51,71],[51,72,51,77],[51,78,51,83],[51,84,51,89],[51,90,51,95],[51,96,51,101],[51,102,51,107],[52,0,52,35],[52,36,52,41],[52,42,52,47],[52,48,52,53],[52,54,52,59],[52,60,52,65],[52,66,52,71],[52,72,52,77],[52,78,52,83],[52,84,52,89],[52,90,52,95],[52,96,52,101],[52,102,52,107],[53,0,53,35],[53,36,53,41],[53,42,53,47],[53,48,53,53],[53,54,53,59],[53,60,53,65],[53,66,53,71],[53,72,53,77],[53,78,53,83],[53,84,53,89],[53,90,53,95],[53,96,53,101],[53,102,53,107],[54,0,54,35],[54,36,54,41],[54,42,54,47],[54,48,54,53],[54,54,54,59],[54,60,54,65],[54,66,54,71],[54,72,54,77],[54,78,54,83],[54,84,54,89],[54,90,54,95],[54,96,54,101],[54,102,54,107],[55,0,55,35],[55,36,55,41],[55,42,55,47],[55,48,55,53],[55,54,55,59],[55,60,55,65],[55,66,55,71],[55,72,55,77],[55,78,55,83],[55,84,55,89],[55,90,55,95],[55,96,55,101],[55,102,55,107],[56,0,56,35],[56,36,56,47],[56,48,56,54],[56,55,56,59],[56,60,56,71],[56,72,56,78],[56,79,56,83],[56,84,56,95],[56,96,56,102],[56,103,56,107],[57,0,57,35],[57,36,57,43],[57,44,57,52],[57,53,57,59],[57,60,57,67],[57,68,57,76],[57,77,57,83],[57,84,57,91],[57,92,57,100],[57,101,57,107],[58,0,58,35],[58,36,58,43],[58,44,58,52],[58,53,58,59],[58,60,58,67],[58,68,58,76],[58,77,58,83],[58,84,58,91],[58,92,58,100],[58,101,58,107],[59,0,59,35],[59,36,59,43],[59,44,59,52],[59,53,59,59],[59,60,59,67],[59,68,59,76],[59,77,59,83],[59,84,59,91],[59,92,59,100],[59,101,59,107],[60,0,60,35],[60,36,60,43],[60,44,60,52],[60,53,60,59],[60,60,60,67],[60,68,60,76],[60,77,60,83],[60,84,60,91],[60,92,60,100],[60,101,60,107],[61,0,61,13],[61,14,61,16],[61,17,61,20],[61,21,61,23],[61,24,61,44],[61,45,61,82],[61,83,61,107],[62,0,62,107]]}
[]
[{"$nulls":3},"Schallschutz SIA-Norm 181 (2020) ",{"$nulls":46},"S",{"$nulls":7},"Schallschutznachweis\nInnenlärm"]
[{"$nulls":21},"Projektkontrolle"]
[]
[{"$nulls":4},"Nur eine Nutzungseinheit: Schallschutznachweis für Innenlärm nicht notwendig"]
[]
[]
["Luftschall",{"$nulls":60},"Siehe beiliegenden Schallschutznachweis"]
[]
["Situation"]
["Trennbauteil"]
["Senderaum: ",{"$nulls":15},"Bezeichnung"]
["                        ",{"$nulls":15},"Nr. / Geschoss"]
["Empfangsraum: ",{"$nulls":15},"Bezeichnung"]
["                        ",{"$nulls":15},"Nr. / Geschoss"]
["Grad der Störung"]
["Lärmempfindlichkeit"]
["Abschlusstüre Ziffer 3.2.2.1",{"$nulls":38},"R'W + C ≥",{"$nulls":15},"dB",{"$nulls":4},10,null,null,"R'W + C ≥",{"$nulls":15},"dB",{"$nulls":4},10,null,null,"R'W + C ≥",{"$nulls":15},"dB"]
["Tieffreq. Emi. nachts Ziffer 3.2.2.2",{"$nulls":38},"tieffreq. in der Nacht",{"$nulls":20},10,null,null,"tieffreq. in der Nacht",{"$nulls":20},10,null,null,"tieffreq. in der Nacht"]
["Massgebende Anforderung ",{"$nulls":35},"Di =",{"$nulls":14},"dB",{"$nulls":8},"Di =",{"$nulls":14},"dB",{"$nulls":8},"Di =",{"$nulls":14},"dB"]
["Trennbauteile",{"$nulls":35},"S [m2]",{"$nulls":7},"R'w [dB]",{"$nulls":7},"C [dB]",{"$nulls":7},"S [m2]",{"$nulls":7},"R'w [dB]",{"$nulls":7},"C [dB]",{"$nulls":7},"S [m2]",{"$nulls":7},"R'w [dB]",{"$nulls":7},"C [dB]"]
{"$rows_empty":8}
["Sres und (R'w + C)res",{"$nulls":35},{"$f":"SUM(AK22:AR29)","v":{"v":0,"d":"0.0"}},{"$nulls":7},{"$f":"IF(AK30>0,ROUND(-10*LOG(\n(AK22*10^((ROUND(-AS22-BA22,1))/10)\n+AK23*10^((ROUND(-AS23-BA23,1))/10)\n+AK24*10^((ROUND(-AS24-BA24,1))/10)\n+AK25*10^((ROUND(-AS25-BA25,1))/10)\n+AK26*10^((ROUND(-AS26-BA26,1))/10)\n+AK27*10^((ROUND(-AS27-BA27,1))/10)\n+AK28*10^((ROUND(-AS28-BA28,1))/10)\n+AK29*10^((ROUND(-AS29-BA29,1))/10)\n)/AK30),1),0)","v":{"v":0,"d":"0.0"}},{"$nulls":15},{"$f":"SUM(BI22:BP29)","v":{"v":0,"d":"0.0"}},{"$nulls":7},{"$f":"IF(BI30>0,ROUND(-10*LOG(\n(BI22*10^((ROUND(-BQ22-BY22,1))/10)\n+BI23*10^((ROUND(-BQ23-BY23,1))/10)\n+BI24*10^((ROUND(-BQ24-BY24,1))/10)\n+BI25*10^((ROUND(-BQ25-BY25,1))/10)\n+BI26*10^((ROUND(-BQ26-BY26,1))/10)\n+BI27*10^((ROUND(-BQ27-BY27,1))/10)\n+BI28*10^((ROUND(-BQ28-BY28,1))/10)\n+BI29*10^((ROUND(-BQ29-BY29,1))/10)\n)/BI30),1),0)","v":{"v":0,"d":"0.0"}},{"$nulls":15},{"$f":"SUM(CG22:CN29)","v":{"v":0,"d":"0.0"}},{"$nulls":7},{"$f":"IF(CG30>0,ROUND(-10*LOG(\n(CG22*10^((ROUND(-CO22-CW22,1))/10)\n+CG23*10^((ROUND(-CO23-CW23,1))/10)\n+CG24*10^((ROUND(-CO24-CW24,1))/10)\n+CG25*10^((ROUND(-CO25-CW25,1))/10)\n+CG26*10^((ROUND(-CO26-CW26,1))/10)\n+CG27*10^((ROUND(-CO27-CW27,1))/10)\n+CG28*10^((ROUND(-CO28-CW28,1))/10)\n+CG29*10^((ROUND(-CO29-CW29,1))/10)\n)/CG30),1),0)","v":{"v":0,"d":"0.0"}}]
["Volumen Empfangsraum",{"$nulls":35},"V =",{"$nulls":15},"m3",{"$nulls":7},"V =",{"$nulls":15},"m3",{"$nulls":7},"V =",{"$nulls":15},"m3"]
["Projektierungszuschlag Kp",{"$nulls":35},"Kp =",{"$nulls":7},{"v":2,"d":"2.0"},{"$nulls":7},"dB",{"$nulls":7},"Kp =",{"$nulls":7},{"v":2,"d":"2.0"},{"$nulls":7},"dB",{"$nulls":7},"Kp =",{"$nulls":7},{"v":2,"d":"2.0"},{"$nulls":7},"dB"]
["Ermittelter Schallschutz",{"$nulls":35},"Di,d =",{"$nulls":7},{"$f":"IF(AND(AK30>0,AS30>0,AS31>0),ROUND(AS30+10*LOG(AS31/AK30)-4.9-AS32,1),0)","v":{"v":0,"d":"0.0"}},{"$nulls":8},"dB",{"$nulls":6},"Di,d =",{"$nulls":7},{"$f":"IF(AND(BI30>0,BQ30>0,BQ31>0),ROUND(BQ30+10*LOG(BQ31/BI30)-4.9-BQ32,1),0)","v":{"v":0,"d":"0.0"}},{"$nulls":8},"dB",{"$nulls":6},"Di,d =",{"$nulls":7},{"$f":"IF(AND(CG30>0,CO30>0,CO31>0),ROUND(CO30+10*LOG(CO31/CG30)-4.9-CO32,1),0)","v":{"v":0,"d":"0.0"}},{"$nulls":8},"dB"]
["Erfüllt ",{"$nulls":43},{"$f":"IF(AND(AT20>0,AS33>0),\nIF(AND(AT20<=AS33,IF($AY$18>0,\nAND(IF(AS22>0,$AS$22+$BA$22>=$AY$18,\nIF(AS23>0,$AS$23+$BA$23>=$AY$18,\nIF(AS24>0,$AS$24+$BA$24>=$AY$18,\nIF(AS25>0,$AS$25+$BA$25>=$AY$18,\nIF(AS26>0,$AS$26+$BA$26>=$AY$18,\nIF(AS27>0,$AS$27+$BA$27>=$AY$18,\nIF(AS28>0,$AS$28+$BA$28>=$AY$18,\nIF(AS29>0,$AS$29+$BA$29>=$AY$18,TRUE)))))))),\nIF(AS23>0,$AS$23+$BA$23>=$AY$18,TRUE),\nIF(AS24>0,$AS$24+$BA$24>=$AY$18,TRUE),\nIF(AS25>0,$AS$25+$BA$25>=$AY$18,TRUE),\nIF(AS26>0,$AS$26+$BA$26>=$AY$18,TRUE),\nIF(AS27>0,$AS$27+$BA$27>=$AY$18,TRUE),\nIF(AS28>0,$AS$28+$BA$28>=$AY$18,TRUE),\nIF(AS29>0,$AS$29+$BA$29>=$AY$18,TRUE)),\n$AT$20-5<=$AS$30)),\"Ja\",\"Nein\"),\"\")","v":""},{"$nulls":23},{"$f":"IF(AND(BR20>0,BQ33>0),\nIF(AND(BR20<=BQ33,IF(BW18>0,\nAND(IF(BQ22>0,BQ22+BY22>=BW18,\nIF(BQ23>0,BQ23+BY23>=BW18,\nIF(BQ24>0,BQ24+BY24>=BW18,\nIF(BQ25>0,BQ25+BY25>=BW18,\nIF(BQ26>0,BQ26+BY26>=BW18,\nIF(BQ27>0,BQ27+BY27>=BW18,\nIF(BQ28>0,BQ28+BY28>=BW18,\nIF(BQ29>0,BQ29+BY29>=BW18,TRUE)))))))),\nIF(BQ23>0,BQ23+BY23>=BW18,TRUE),\nIF(BQ24>0,BQ24+BY24>=BW18,TRUE),\nIF(BQ25>0,BQ25+BY25>=BW18,TRUE),\nIF(BQ26>0,BQ26+BY26>=BW18,TRUE),\nIF(BQ27>0,BQ27+BY27>=BW18,TRUE),\nIF(BQ28>0,BQ28+BY28>=BW18,TRUE),\nIF(BQ29>0,BQ29+BY29>=BW18,TRUE)),\nBR20-5<=BQ30)),\"Ja\",\"Nein\"),\"\")","v":""},{"$nulls":23},{"$f":"IF(AND(CP20>0,CO33>0),\nIF(AND(CP20<=CO33,IF(CU18>0,\nAND(IF(CO22>0,CO22+CW22>=CU18,\nIF(CO23>0,CO23+CW23>=CU18,\nIF(CO24>0,CO24+CW24>=CU18,\nIF(CO25>0,CO25+CW25>=CU18,\nIF(CO26>0,CO26+CW26>=CU18,\nIF(CO27>0,CO27+CW27>=CU18,\nIF(CO28>0,CO28+CW28>=CU18,\nIF(CO29>0,CO29+CW29>=CU18,TRUE)))))))),\nIF(CO23>0,CO23+CW23>=CU18,TRUE),\nIF(CO24>0,CO24+CW24>=CU18,TRUE),\nIF(CO25>0,CO25+CW25>=CU18,TRUE),\nIF(CO26>0,CO26+CW26>=CU18,TRUE),\nIF(CO27>0,CO27+CW27>=CU18,TRUE),\nIF(CO28>0,CO28+CW28>=CU18,TRUE),\nIF(CO29>0,CO29+CW29>=CU18,TRUE)),\nCP20-5<=CO30)),\"Ja\",\"Nein\"),\"\")","v":""}]
[]
["Trittschall",{"$nulls":60},"Siehe beiliegenden Schallschutznachweis"]
[]
["Situation"]
["Trennbauteil"]
["Senderaum: ",{"$nulls":15},"Bezeichnung"]
["                        ",{"$nulls":15},"Nr. / Geschoss"]
["Empfangsraum: ",{"$nulls":15},"Bezeichnung"]
["                        ",{"$nulls":15},"Nr. / Geschoss"]
["Grad der Störung"]
["Lärmempfindlichkeit"]
["Spezielle Fälle 3.3.2 ff",{"$nulls":38},"Umbau",{"$nulls":11},"Balkon",{"$nulls":11},"Umbau",{"$nulls":11},"Balkon",{"$nulls":11},"Umbau",{"$nulls":11},"Balkon"]
["Massgebende Anforderung ",{"$nulls":35},"L' =",{"$nulls":14},"dB",{"$nulls":8},"L' =",{"$nulls":14},"dB",{"$nulls":8},"L' =",{"$nulls":14},"dB"]
[]
["Trennbauteile",{"$nulls":35},"d [cm]",{"$nulls":5},"L'n,w",{"$nulls":5},"DLW",{"$nulls":5},"CI",{"$nulls":5},"d [cm]",{"$nulls":5},"L'n,w",{"$nulls":5},"DLW",{"$nulls":5},"CI",{"$nulls":5},"d [cm]",{"$nulls":5},"L'n,w",{"$nulls":5},"DLW",{"$nulls":5},"CI"]
[{"$nulls":48},"-----",{"$nulls":23},"-----",{"$nulls":23},"-----"]
[]
[{"$nulls":60},{"v":0,"d":"0.0"},{"$nulls":23},{"v":0,"d":"0.0"}]
[{"$nulls":42},{"v":0,"d":"0.0"},{"$nulls":23},{"v":0,"d":"0.0"},{"$nulls":23},{"v":0,"d":"0.0"}]
[{"$nulls":36},{"v":0,"d":"0.0"},{"$nulls":23},{"v":0,"d":"0.0"},{"$nulls":23},{"v":0,"d":"0.0"}]
[{"$nulls":42},{"v":0,"d":"0.0"},{"$nulls":23},{"v":0,"d":"0.0"},{"$nulls":23},{"v":0,"d":"0.0"}]
[{"$nulls":66},{"v":0,"d":"0.0"},{"$nulls":23},{"v":0,"d":"0.0"}]
["Wert für gesamten Aufbau",{"$nulls":35},"L'n,w + CI =",{"$nulls":11},{"$f":"ROUND(SUM(AQ50:AV56) + IF(BC50>0, BC50,0) + IF(BC51>0, BC51,0) + IF(BC52>0, BC52,0) + IF(BC53>0, BC53,0) + IF(BC54>0, BC54,0) + IF(BC55>0, BC55,0) + IF(BC56>0, BC56,0) - SUM(AW51:BB56),1)","v":{"v":0,"d":"0.0"}},{"$nulls":6},"dB",{"$nulls":4},"L'n,w + CI =",{"$nulls":11},{"$f":"ROUND(SUM(BO50:BT56) + IF(CA50>0, CA50,0) + IF(CA51>0, CA51,0) + IF(CA52>0, CA52,0) + IF(CA53>0, CA53,0) + IF(CA54>0, CA54,0) + IF(CA55>0, CA55,0) + IF(CA56>0, CA56,0) - SUM(BU51:BZ56),1)","v":{"v":0,"d":"0.0"}},{"$nulls":6},"dB",{"$nulls":4},"L'n,w + CI =",{"$nulls":11},{"$f":"ROUND(SUM(CM50:CR56) + IF(CY50>0, CY50,0) + IF(CY51>0, CY51,0) + IF(CY52>0, CY52,0) + IF(CY53>0, CY53,0) + IF(CY54>0, CY54,0) + IF(CY55>0, CY55,0) + IF(CY56>0, CY56,0) - SUM(CS51:CX56),1)","v":{"v":0,"d":"0.0"}},{"$nulls":6},"dB"]
["Volumen Empfangsraum",{"$nulls":35},"V =",{"$nulls":16},"m3",{"$nulls":6},"V =",{"$nulls":16},"m3",{"$nulls":6},"V =",{"$nulls":16},"m3"]
["Projektierungszuschlag Kp",{"$nulls":35},"Kp =",{"$nulls":7},{"v":5,"d":"5.0"},{"$nulls":8},"dB",{"$nulls":6},"Kp =",{"$nulls":7},{"v":5,"d":"5.0"},{"$nulls":8},"dB",{"$nulls":6},"Kp =",{"$nulls":7},{"v":5,"d":"5.0"},{"$nulls":8},"dB"]
["Ermittelter Schallpegel",{"$nulls":35},"L'd =",{"$nulls":7},{"$f":"IF(AND(AW57>0,AS58>0),ROUND((AW57-10*LOG(AS58)+14.9+AS59),1),0)","v":{"v":0,"d":"0.0"}},{"$nulls":8},"dB",{"$nulls":6},"L'd =",{"$nulls":7},{"$f":"IF(AND(BU57>0,BQ58>0),ROUND(BU57-10*LOG(BQ58)+14.9+BQ59,1),0)","v":{"v":0,"d":"0.0"}},{"$nulls":8},"dB",{"$nulls":6},"L'd =",{"$nulls":7},{"$f":"IF(AND(CS57>0,CO58>0),ROUND(CS57-10*LOG(CO58)+14.9+CO59,1),0)","v":{"v":0,"d":"0.0"}},{"$nulls":8},"dB"]
["Erfüllt",{"$nulls":43},{"$f":"IF(AND(AT47>0,AW57>0,AS58>0),IF(AT47<AS60,\"Nein\",\"Ja\"),\"\")","v":""},{"$nulls":23},{"$f":"IF(AND(BR47>0,BU57>0,BQ58>0),IF(BR47<BQ60,\"Nein\",\"Ja\"),\"\")","v":""},{"$nulls":23},{"$f":"IF(AND(CP47>0,CS57>0,CO58>0),IF(CP47<CO60,\"Nein\",\"Ja\"),\"\")","v":""}]
["Formular S Seite ",{"$nulls":13},2,null,null,"von",{"$nulls":3},3,{"$nulls":23},"Formular S",{"$nulls":37},"Version vom 30. November 2020"]

{"sheet":"Konstruktion","index":2,"n_rows":61,"n_cols":103,"rows_kept":61,"merged":[[0,0,0,107],[1,0,1,2],[1,50,3,57],[1,58,3,107],[4,0,4,3],[4,4,4,107],[6,0,6,107],[7,0,7,56],[7,57,7,60],[7,61,7,107],[8,0,8,107],[9,0,9,4],[9,5,9,30],[9,31,9,77],[9,78,9,83],[9,84,9,89],[9,90,9,95],[9,96,9,101],[9,102,9,107],[10,0,10,4],[10,5,10,30],[10,31,10,77],[10,78,10,83],[10,84,10,89],[10,90,10,95],[10,96,10,101],[10,102,10,107],[11,0,11,4],[11,5,11,30],[11,31,11,77],[11,78,11,83],[11,84,11,89],[11,90,11,95],[11,96,11,101],[11,102,11,107],[12,0,12,4],[12,5,12,30],[12,31,12,77],[12,78,12,83],[12,84,12,89],[12,90,12,95],[12,96,12,101],[12,102,12,107],[13,0,13,4],[13,5,13,30],[13,31,13,77],[13,78,13,83],[13,84,13,89],[13,90,13,95],[13,96,13,101],[13,102,13,107],[14,0,14,4],[14,5,14,30],[14,31,14,77],[14,78,14,83],[14,84,14,89],[14,90,14,95],[14,96,14,101],[14,102,14,107],[15,0,15,4],[15,5,15,30],[15,31,15,77],[15,78,15,83],[15,84,15,89],[15,90,15,95],[15,96,15,101],[15,102,15,107],[16,0,16,4],[16,5,16,30],[16,31,16,77],[16,78,16,83],[16,84,16,89],[16,90,16,95],[16,96,16,101],[16,102,16,107],[17,0,17,4],[17,5,17,30],[17,31,17,77],[17,78,17,83],[17,84,17,89],[17,90,17,95],[17,96,17,101],[17,102,17,107],[18,0,18,4],[18,5,18,30],[18,31,18,77],[18,78,18,83],[18,84,18,89],[18,90,18,95],[18,96,18,101],[18,102,18,107],[19,0,19,4],[19,5,19,30],[19,31,19,77],[19,78,19,83],[19,84,19,89],[19,90,19,95],[19,96,19,101],[19,102,19,107],[20,0,20,4],[20,5,20,30],[20,31,20,77],[20,78,20,83],[20,84,20,89],[20,90,20,95],[20,96,20,101],[20,102,20,107],[21,0,21,4],[21,5,21,30],[21,31,21,77],[21,78,21,83],[21,84,21,89],[21,90,21,95],[21,96,21,101],[21,102,21,107],[22,0,22,4],[22,5,22,30],[22,31,22,77],[22,78,22,83],[22,84,22,89],[22,90,22,95],[22,96,22,101],[22,102,22,107],[23,0,23,4],[23,5,23,30],[23,31,23,77],[23,78,23,83],[23,84,23,89],[23,90,23,95],[23,96,23,101],[23,102,23,107],[24,0,24,4],[24,5,24,30],[24,31,24,77],[24,78,24,83],[24,84,24,89],[24,90,24,95],[24,96,24,101],[24,102,24,107],[25,0,25,4],[25,5,25,30],[25,31,25,77],[25,78,25,83],[25,84,25,89],[25,90,25,95],[25,96,25,101],[25,102,25,107],[26,0,26,4],[26,5,26,30],[26,31,26,77],[26,78,26,83],[26,84,26,89],[26,90,26,95],[26,96,26,101],[26,102,26,107],[27,0,27,4],[27,5,27,30],[27,31,27,77],[27,78,27,83],[27,84,27,89],[27,90,27,95],[27,96,27,101],[27,102,27,107],[28,0,28,4],[28,5,28,30],[28,31,28,77],[28,78,28,83],[28,84,28,89],[28,90,28,95],[28,96,28,101],[28,102,28,107],[29,0,29,107],[30,0,30,56],[30,57,30,60],[30,61,30,107],[31,0,31,107],[32,0,32,4],[32,5,32,30],[32,31,32,77],[32,78,32,83],[32,84,32,89],[32,90,32,95],[32,96,32,101],[32,102,32,107],[33,0,33,4],[33,5,33,30],[33,31,33,77],[33,78,33,83],[33,84,33,89],[33,90,33,95],[33,96,33,101],[33,102,33,107],[34,0,34,4],[34,5,34,30],[34,31,34,77],[34,78,34,83],[34,84,34,89],[34,90,34,95],[34,96,34,101],[34,102,34,107],[35,0,35,4],[35,5,35,30],[35,31,35,77],[35,78,35,83],[35,84,35,89],[35,90,35,95],[35,96,35,101],[35,102,35,107],[36,0,36,4],[36,5,36,30],[36,31,36,77],[36,78,36,83],[36,84,36,89],[36,90,36,95],[36,96,36,101],[36,102,36,107],[37,0,37,4],[37,5,37,30],[37,31,37,77],[37,78,37,83],[37,84,37,89],[37,90,37,95],[37,96,37,101],[37,102,37,107],[38,0,38,4],[38,5,38,30],[38,31,38,77],[38,78,38,83],[38,84,38,89],[38,90,38,95],[38,96,38,101],[38,102,38,107],[39,0,39,4],[39,5,39,30],[39,31,39,77],[39,78,39,83],[39,84,39,89],[39,90,39,95],[39,96,39,101],[39,102,39,107],[40,0,40,4],[40,5,40,30],[40,31,40,77],[40,78,40,83],[40,84,40,89],[40,90,40,95],[40,96,40,101],[40,102,40,107],[41,0,41,4],[41,5,41,30],[41,31,41,77],[41,78,41,83],[41,84,41,89],[41,90,41,95],[41,96,41,101],[41,102,41,107],[42,0,42,4],[42,5,42,30],[42,31,42,77],[42,78,42,83],[42,84,42,89],[42,90,42,95],[42,96,42,101],[42,102,42,107],[43,0,43,4],[43,5,43,30],[43,31,43,77],[43,78,43,83],[43,84,43,89],[43,90,43,95],[43,96,43,101],[43,102,43,107],[44,0,44,4],[44,5,44,30],[44,31,44,77],[44,78,44,83],[44,84,44,89],[44,90,44,95],[44,96,44,101],[44,102,44,107],[45,0,45,4],[45,5,45,30],[45,31,45,77],[45,78,45,83],[45,84,45,89],[45,90,45,95],[45,96,45,101],[45,102,45,107],[46,0,46,4],[46,5,46,30],[46,31,46,77],[46,78,46,83],[46,84,46,89],[46,90,46,95],[46,96,46,101],[46,102,46,107],[47,0,47,4],[47,5,47,30],[47,31,47,77],[47,78,47,83],[47,84,47,89],[47,90,47,95],[47,96,47,101],[47,102,47,107],[48,0,48,4],[48,5,48,30],[48,31,48,77],[48,78,48,83],[48,84,48,89],[48,90,48,95],[48,96,48,101],[48,102,48,107],[49,0,49,4],[49,5,49,30],[49,31,49,77],[49,78,49,83],[49,84,49,89],[49,90,49,95],[49,96,49,101],[49,102,49,107],[50,0,50,4],[50,5,50,30],[50,31,50,77],[50,78,50,83],[50,84,50,89],[50,90,50,95],[50,96,50,101],[50,102,50,107],[51,0,51,4],[51,5,51,30],[51,31,51,77],[51,78,51,83],[51,84,51,89],[51,90,51,95],[51,96,51,101],[51,102,51,107],[52,0,52,107],[53,0,53,107],[54,0,54,107],[55,0,55,107],[56,0,56,107],[57,0,57,107],[58,0,58,107],[59,0,59,107],[60,0,60,13],[60,14,60,16],[60,17,60,20],[60,21,60,23],[60,24,60,44],[60,45,60,82],[60,83,60,107],[61,0,61,107]]}
[]
[{"$nulls":3},"Schallschutz SIA-Norm 181 (2020) ",{"$nulls":46},"S",{"$nulls":7},"Schallschutznachweis\nKonstruktionsbeschrieb"]
[{"$nulls":21},"Projektkontrolle"]
[]
[]
["Zusätzliche Angaben zu den Bauteilen (fakultativ)."]
[]
["Luftschall Konstruktionsbeschrieb ",{"$nulls":60},"Siehe beiliegender Produktebeschrieb"]
[]
["Nr",{"$nulls":4},"Bauteil",{"$nulls":25},"Konstruktionsbeschrieb",{"$nulls":46},"Rw   [dB]",{"$nulls":5},"KF [dB]",{"$nulls":5},"R'w   [dB]",{"$nulls":5},"Ctr   [dB]",{"$nulls":5},"C   [dB]"]
[" "]
{"$rows_empty":19}
["Trittschall Konstruktionsbeschrieb ",{"$nulls":60},"Siehe beiliegender Produktebeschrieb"]
[]
["Nr",{"$nulls":4},"Bauteil",{"$nulls":25},"Konstruktionsbeschrieb",{"$nulls":46},"Ln,w  [dB]",{"$nulls":5},"KF [dB]",{"$nulls":5},"L'n,w  [dB]",{"$nulls":5},"DLW  [dB]",{"$nulls":5},"CI  [dB]"]
{"$rows_empty":20}
["Bemerkungen"]
[]
[]
[]
[]
[]
[]
["Formular S Seite ",{"$nulls":13},3,null,null,"von",{"$nulls":3},3,{"$nulls":23},"Formular S",{"$nulls":37},"Version vom 30. November 2020"]

{"sheet":"Kurzinformation","index":3,"n_rows":40,"n_cols":59,"rows_kept":40,"merged":[[0,0,0,107],[1,0,1,2],[1,50,3,57],[1,58,3,107],[4,0,4,3],[4,4,4,107],[7,0,7,107],[8,0,8,107],[10,0,10,107],[11,0,11,107],[13,0,13,107],[18,0,18,107],[20,0,20,107],[22,0,22,107],[27,0,27,107],[28,0,28,107],[30,0,30,107],[37,0,37,107],[39,0,39,107]]}
[]
[{"$nulls":3},"Schallschutz SIA-Norm 181 (2020) ",{"$nulls":46},"S",{"$nulls":7},"Schallschutzformular\nKurzinformation"]
[{"$nulls":21},"Projektkontrolle"]
[]
[]
["Hinweise zum Formular S \"Schallschutz SIA-Norm 181 (2020), Projektkontrolle\""]
["Allgemeines"]
["Das Formular berechnet die Schallschutzwerte für Aussenlärm sowie Innenlärm Luftschall und Trittschall zwischen Nutzungseinheiten. Die Fachstelle Lärmschutz haftet nicht für Berechnungsfehler. "]
["Das Formular Schallschutznachweis sowie weitere Informationen sind unter www.zh.ch/schallschutz \n(-> Schallschutz – Gebäudeaussenhülle) zu finden."]
["Projektierungszuschlag / Blatt Konstruktion"]
["Es liegt in der Verantwortung des Anwenders einen angemessenen Projektierungszuschlag KP für die Unsicherheiten einzusetzen, damit die Anforderungen bei Kontrollmessungen mit hoher Wahrscheinlichkeit eingehalten werden können (siehe Ziffer 1.1.1.31). Der gemessene Nachweis gilt ohne Toleranzen. "]
["Im Tabellenblatt «Konstruktion» können detaillierte Angaben über die gewählten Bauteile, vorhandene Messberichte sowie die Annahmen zur Schätzung fehlender Angaben (z.B. Flankenübertragung) dokumentiert werden."]
["Aussenlärm"]
["Der Projektierungswert De,d unter Berücksichtigung des Projektierungszuschlag KP muss grösser oder gleich wie der Anforderungswert De sein. Die gesetzlichen Anforderungen (Art. 32 LSV) an den De-Wert sind auf https://www.bauen-im-laerm.ch/schallschutz/anforderungswerte/ publiziert und weichen von der Norm SIA 181:2020 ab."]
["De,d = De,tot - KP ≥  De"]
["Zusätzlich gilt:"]
["(R’45°,w + Ctr)res ≥ De – 5"]
["Spezielle Fälle (Auswahl):"]
["- Bei ausschliesslicher Tagesnutzung nach Ziffer 3.1.2.2 gilt nur der Tageswert"]
["Innenlärm"]
["Weist das Bauvorhaben nur eine Nutzungseinheit auf, so kann auf einen Schallschutznachweis für den Teil Innenlärm verzichtet werden. "]
["Innenlärm Luftschall"]
["Der Projektierungswert Di,d unter Berücksichtigung des Projektierungszuschlag KP muss grösser oder gleich wie der Anforderungswert Di sein."]
["Di,d = Di,tot - KP ≥  Di"]
["Zusätzlich gilt:"]
["(R’w + C)res ≥ Di - 5"]
["Spezielle Fälle:"]
["- Für Räume mit Abschlusstüren gegen Erschliessungszonen gilt ein um 5 dB bzw. 10 dB reduzierter Wert gegenüber der Tabelle 3. Zusätzlich gilt die Anforderung an Türe und weitere Trennbauteile von R’w + C ≥ 37 bzw. 32 dB (siehe Ziffer 3.2.2.1). Da das Bau-Schalldämm-Mass des massgebenden Bauteils (Türe) verbindlich festgehalten wird, kann bei der Berechnung des Anforderungswertes Di auf den Projektierungszuschlag KP verzichtet werden."]
["- Beim Nachweis für erheblich tieffrequente Emissionen in der Nacht nach Ziffer 3.2.2.2 gelten sinngemäss die Grössen Ctr,50-3150 und Di50."]
["Innenlärm Trittschall"]
["Der Projektierungswert L'd im Empfangsraum unter Berücksichtigung des Projektierungszuschlag KP muss kleiner oder gleich wie der Anforderungswert L'  sein."]
["L'd = L'tot + KP ≤  L'"]
["Der Spektrum-Anpassungswert CI für Trittschall darf nicht negativ sein (siehe Ziffer 3.3.3.2)."]
["Spezielle Fälle (Auswahl): "]
["- Umbauten und Umnutzungen nach Ziffer 3.3.2.1"]
["- Balkone nach Ziffer 3.3.2.2"]
["- Duschen nach Ziffer 3.3.2.3"]
["- Intensiv genutzte begehbare Konstruktionen nach Ziffer 3.3.2.5 müssen zusätzlich die Anforderungen gemäss Ziffer 3.4 einhalten"]
["Schutz gegenüber Geräuschen gebäudetechnischer Anlagen und fester Einrichtungen"]
["Die Anforderungen müssen erfüllt werden, auch wenn sie in der Projektierung nicht in diesem Formular vorgerechnet werden müssen."]

{"sheet":"Beispiele","index":4,"n_rows":115,"n_cols":105,"rows_kept":115,"merged":[[0,0,0,107],[1,0,1,2],[1,50,3,57],[1,58,3,107],[4,0,4,13],[4,14,4,52],[4,54,4,64],[4,65,4,77],[4,78,4,88],[4,89,4,107],[5,0,5,13],[5,14,5,107],[6,0,6,107],[7,0,7,107],[8,0,8,107],[9,0,9,2],[9,3,9,24],[9,25,9,30],[9,31,9,45],[9,46,9,51],[9,52,9,65],[9,66,9,107],[10,0,10,2],[10,3,10,24],[10,25,10,30],[10,31,10,45],[10,46,10,51],[10,52,10,65],[10,66,10,107],[11,0,11,2],[11,3,11,24],[11,25,11,30],[11,31,11,45],[11,46,11,51],[11,52,11,64],[11,66,11,107],[12,0,12,2],[12,3,12,10],[12,11,12,107],[13,0,13,2],[13,3,13,45],[13,46,13,107],[14,0,14,107],[15,0,15,107],[16,0,16,56],[16,57,16,60],[16,61,16,107],[17,0,17,107],[18,0,18,15],[18,16,18,35],[18,36,18,59],[18,60,18,83],[18,84,18,107],[19,0,19,15],[19,16,19,35],[19,36,19,59],[19,60,19,83],[19,84,19,107],[20,16,20,35],[20,36,20,59],[20,60,20,83],[20,84,20,107],[21,0,21,35],[21,36,21,43],[21,44,21,47],[21,48,21,55],[21,56,21,59],[21,60,21,67],[21,68,21,71],[21,72,21,79],[21,80,21,83],[21,84,21,91],[21,92,21,95],[21,96,21,103],[21,104,21,107],[22,0,22,35],[22,36,22,59],[22,60,22,83],[22,84,22,107],[23,0,23,35],[23,36,23,44],[23,45,23,50],[23,51,23,59],[23,60,23,68],[23,69,23,74],[23,75,23,83],[23,84,23,92],[23,93,23,98],[23,99,23,107],[24,0,24,35],[24,36,24,43],[24,44,24,51],[24,52,24,59],[24,60,24,67],[24,68,24,75],[24,76,24,83],[24,84,24,91],[24,92,24,99],[24,100,24,107],[25,0,25,35],[25,36,25,43],[25,44,25,51],[25,52,25,59],[25,60,25,67],[25,68,25,75],[25,76,25,83],[25,84,25,91],[25,92,25,99],[25,100,25,107],[26,0,26,35],[26,36,26,43],[26,44,26,51],[26,52,26,59],[26,60,26,67],[26,68,26,75],[26,76,26,83],[26,84,26,91],[26,92,26,99],[26,100,26,107],[27,0,27,35],[27,36,27,43],[27,44,27,51],[27,52,27,59],[27,60,27,67],[27,68,27,75],[27,76,27,83],[27,84,27,91],[27,92,27,99],[27,100,27,107],[28,0,28,35],[28,36,28,43],[28,44,28,51],[28,52,28,59],[28,60,28,67],[28,68,28,75],[28,76,28,83],[28,84,28,91],[28,92,28,99],[28,100,28,107],[29,0,29,35],[29,36,29,43],[29,44,29,51],[29,52,29,59],[29,60,29,67],[29,68,29,75],[29,76,29,83],[29,84,29,91],[29,92,29,99],[29,100,29,107],[30,0,30,35],[30,36,30,43],[30,44,30,51],[30,52,30,59],[30,60,30,67],[30,68,30,75],[30,76,30,83],[30,84,30,91],[30,92,30,99],[30,100,30,107],[31,0,31,35],[31,36,31,43],[31,44,31,51],[31,52,31,59],[31,60,31,67],[31,68,31,75],[31,76,31,83],[31,84,31,91],[31,92,31,99],[31,100,31,107],[32,0,32,35],[32,36,32,43],[32,44,32,51],[32,52,32,59],[32,60,32,67],[32,68,32,75],[32,76,32,83],[32,84,32,91],[32,92,32,99],[32,100,32,107],[33,0,33,35],[33,36,33,43],[33,44,33,59],[33,60,33,67],[33,68,33,83],[33,84,33,91],[33,92,33,107],[34,0,34,35],[34,36,34,43],[34,44,34,51],[34,52,34,59],[34,60,34,67],[34,68,34,75],[34,76,34,83],[34,84,34,91],[34,92,34,99],[34,100,34,107],[35,0,35,35],[35,36,35,43],[35,44,35,51],[35,52,35,59],[35,60,35,67],[35,68,35,75],[35,76,35,83],[35,84,35,91],[35,92,35,99],[35,100,35,107],[36,0,36,35],[36,36,36,43],[36,44,36,52],[36,53,36,59],[36,60,36,67],[36,68,36,76],[36,77,36,83],[36,84,36,91],[36,92,36,100],[36,101,36,107],[37,0,37,35],[37,36,37,43],[37,44,37,52],[37,53,37,59],[37,60,37,67],[37,68,37,76],[37,77,37,83],[37,84,37,91],[37,92,37,100],[37,101,37,107],[38,0,38,107],[39,0,39,107],[40,0,40,107],[41,0,41,90],[41,91,41,94],[41,95,41,97],[41,98,41,101],[41,102,41,107],[43,0,43,20],[43,21,43,22],[43,23,43,62],[43,63,43,64],[43,65,43,66],[43,67,43,107],[44,0,45,20],[44,21,44,22],[44,23,44,62],[44,63,44,64],[44,65,44,66],[44,67,44,107],[45,21,45,22],[45,23,45,62],[45,63,45,64],[45,65,45,66],[45,67,45,107],[46,0,46,20],[46,21,46,22],[46,23,46,62],[46,63,46,64],[46,65,46,66],[46,67,46,107],[47,0,47,20],[47,21,47,22],[47,23,47,62],[47,63,47,64],[47,65,47,66],[47,67,47,107],[48,0,48,20],[48,21,48,22],[48,23,48,62],[48,63,48,64],[48,65,48,66],[48,67,48,107],[49,0,49,20],[49,21,49,22],[49,23,49,62],[49,63,49,64],[49,65,49,66],[49,67,49,88],[49,89,49,92],[49,93,49,107],[50,0,50,20],[50,21,50,22],[50,23,50,62],[50,63,50,64],[50,65,50,66],[50,67,50,73],[50,74,50,107],[51,0,51,107],[52,0,52,13],[52,14,52,16],[52,17,52,20],[52,21,52,23],[52,24,52,44],[52,45,52,82],[52,83,52,107],[53,0,53,107],[54,0,54,2],[54,50,56,57],[54,58,56,107],[57,0,57,3],[57,4,57,107],[58,0,58,107],[59,0,59,107],[60,0,60,56],[60,57,60,60],[60,61,60,107],[61,0,61,107],[62,0,62,35],[62,36,62,59],[62,60,62,83],[62,84,62,107],[63,0,63,35],[63,36,63,59],[63,60,63,83],[63,84,63,107],[64,0,64,15],[64,16,64,35],[64,36,64,59],[64,60,64,83],[64,84,64,107],[65,16,65,35],[65,36,65,59],[65,60,65,83],[65,84,65,107],[66,0,66,15],[66,16,66,35],[66,36,66,59],[66,60,66,83],[66,84,66,107],[67,16,67,35],[67,36,67,59],[67,60,67,83],[67,84,67,107],[68,0,68,35],[68,36,68,59],[68,60,68,83],[68,84,68,107],[69,0,69,35],[69,36,69,59],[69,60,69,83],[69,84,69,107],[70,0,70,35],[70,39,70,49],[70,50,70,54],[70,55,70,59],[70,63,70,73],[70,74,70,78],[70,79,70,83],[70,87,70,97],[70,98,70,102],[70,103,70,107],[71,0,71,35],[71,39,71,59],[71,63,71,83],[71,87,71,107],[72,0,72,35],[72,36,72,44],[72,45,72,50],[72,51,72,59],[72,60,72,68],[72,69,72,74],[72,75,72,83],[72,84,72,92],[72,93,72,98],[72,99,72,107],[73,0,73,35],[73,36,73,43],[73,44,73,51],[73,52,73,59],[73,60,73,67],[73,68,73,75],[73,76,73,83],[73,84,73,91],[73,92,73,99],[73,100,73,107],[74,0,74,35],[74,36,74,43],[74,44,74,51],[74,52,74,59],[74,60,74,67],[74,68,74,75],[74,76,74,83],[74,84,74,91],[74,92,74,99],[74,100,74,107],[75,0,75,35],[75,36,75,43],[75,44,75,51],[75,52,75,59],[75,60,75,67],[75,68,75,75],[75,76,75,83],[75,84,75,91],[75,92,75,99],[75,100,75,107],[76,0,76,35],[76,36,76,43],[76,44,76,51],[76,52,76,59],[76,60,76,67],[76,68,76,75],[76,76,76,83],[76,84,76,91],[76,92,76,99],[76,100,76,107],[77,0,77,35],[77,36,77,43],[77,44,77,51],[77,52,77,59],[77,60,77,67],[77,68,77,75],[77,76,77,83],[77,84,77,91],[77,92,77,99],[77,100,77,107],[78,0,78,35],[78,36,78,43],[78,44,78,51],[78,52,78,59],[78,60,78,67],[78,68,78,75],[78,76,78,83],[78,84,78,91],[78,92,78,99],[78,100,78,107],[79,0,79,35],[79,36,79,43],[79,44,79,51],[79,52,79,59],[79,60,79,67],[79,68,79,75],[79,76,79,83],[79,84,79,91],[79,92,79,99],[79,100,79,107],[80,0,80,35],[80,36,80,43],[80,44,80,51],[80,52,80,59],[80,60,80,67],[80,68,80,75],[80,76,80,83],[80,84,80,91],[80,92,80,99],[80,100,80,107],[81,0,81,35],[81,36,81,43],[81,44,81,51],[81,52,81,59],[81,60,81,67],[81,68,81,75],[81,76,81,83],[81,84,81,91],[81,92,81,99],[81,100,81,107],[82,0,82,35],[82,36,82,43],[82,44,82,59],[82,60,82,67],[82,68,82,83],[82,84,82,91],[82,92,82,107],[83,0,83,35],[83,36,83,43],[83,44,83,51],[83,52,83,59],[83,60,83,67],[83,68,83,75],[83,76,83,83],[83,84,83,91],[83,92,83,99],[83,100,83,107],[84,0,84,35],[84,36,84,43],[84,44,84,51],[84,52,84,59],[84,60,84,67],[84,68,84,75],[84,76,84,83],[84,84,84,91],[84,92,84,99],[84,100,84,107],[85,0,85,35],[85,36,85,43],[85,44,85,52],[85,53,85,59],[85,60,85,67],[85,68,85,76],[85,77,85,83],[85,84,85,91],[85,92,85,100],[85,101,85,107],[86,0,86,35],[86,36,86,43],[86,44,86,52],[86,53,86,59],[86,60,86,67],[86,68,86,76],[86,77,86,83],[86,84,86,91],[86,92,86,100],[86,101,86,107],[87,0,87,107],[88,0,88,56],[88,57,88,60],[88,61,88,107],[89,0,89,107],[90,0,90,35],[90,36,90,59],[90,60,90,83],[90,84,90,107],[91,0,91,35],[91,36,91,59],[91,60,91,83],[91,84,91,107],[92,0,92,15],[92,16,92,35],[92,36,92,59],[92,60,92,83],[92,84,92,107],[93,16,93,35],[93,36,93,59],[93,60,93,83],[93,84,93,107],[94,0,94,15],[94,16,94,35],[94,36,94,59],[94,60,94,83],[94,84,94,107],[95,16,95,35],[95,36,95,59],[95,60,95,83],[95,84,95,107],[96,0,96,35],[96,36,96,59],[96,60,96,83],[96,84,96,107],[97,0,97,35],[97,36,97,59],[97,60,97,83],[97,84,97,107],[98,0,98,35],[99,0,99,35],[99,36,99,44],[99,45,99,50],[99,51,99,59],[99,60,99,68],[99,69,99,74],[99,75,99,83],[99,84,99,92],[99,93,99,98],[99,99,99,107],[100,0,100,35],[100,36,100,41],[100,42,100,47],[100,48,100,53],[100,60,100,65],[100,66,100,71],[100,72,100,77],[100,84,100,89],[100,90,100,95],[100,96,100,101],[101,0,101,35],[101,36,101,41],[101,42,101,47],[101,48,101,53],[101,54,101,59],[101,60,101,65],[101,66,101,71],[101,72,101,77],[101,78,101,83],[101,84,101,89],[101,90,101,95],[101,96,101,101],[101,102,101,107],[102,0,102,35],[102,36,102,41],[102,42,102,47],[102,48,102,53],[102,54,102,59],[102,60,102,65],[102,66,102,71],[102,72,102,77],[102,78,102,83],[102,84,102,89],[102,90,102,95],[102,96,102,101],[102,102,102,107],[103,0,103,35],[103,36,103,41],[103,42,103,47],[103,48,103,53],[103,54,103,59],[103,60,103,65],[103,66,103,71],[103,72,103,77],[103,78,103,83],[103,84,103,89],[103,90,103,95],[103,96,103,101],[103,102,103,107],[104,0,104,35],[104,36,104,41],[104,42,104,47],[104,48,104,53],[104,54,104,59],[104,60,104,65],[104,66,104,71],[104,72,104,77],[104,78,104,83],[104,84,104,89],[104,90,104,95],[104,96,104,101],[104,102,104,107],[105,0,105,35],[105,36,105,41],[105,42,105,47],[105,48,105,53],[105,54,105,59],[105,60,105,65],[105,66,105,71],[105,72,105,77],[105,78,105,83],[105,84,105,89],[105,90,105,95],[105,96,105,101],[105,102,105,107],[106,0,106,35],[106,36,106,41],[106,42,106,47],[106,48,106,53],[106,54,106,59],[106,60,106,65],[106,66,106,71],[106,72,106,77],[106,78,106,83],[106,84,106,89],[106,90,106,95],[106,96,106,101],[106,102,106,107],[107,0,107,35],[107,36,107,41],[107,42,107,47],[107,48,107,53],[107,54,107,59],[107,60,107,65],[107,66,107,71],[107,72,107,77],[107,78,107,83],[107,84,107,89],[107,90,107,95],[107,96,107,101],[107,102,107,107],[108,0,108,35],[108,36,108,41],[108,42,108,47],[108,48,108,53],[108,54,108,59],[108,60,108,65],[108,66,108,71],[108,72,108,77],[108,78,108,83],[108,84,108,89],[108,90,108,95],[108,96,108,101],[108,102,108,107],[109,0,109,35],[109,36,109,47],[109,48,109,54],[109,55,109,59],[109,60,109,71],[109,72,109,78],[109,79,109,83],[109,84,109,95],[109,96,109,102],[109,103,109,107],[110,0,110,35],[110,36,110,43],[110,44,110,52],[110,53,110,59],[110,60,110,67],[110,68,110,76],[110,77,110,83],[110,84,110,91],[110,92,110,100],[110,101,110,107],[111,0,111,35],[111,36,111,43],[111,44,111,52],[111,53,111,59],[111,60,111,67],[111,68,111,76],[111,77,111,83],[111,84,111,91],[111,92,111,100],[111,101,111,107],[112,0,112,35],[112,36,112,43],[112,44,112,52],[112,53,112,59],[112,60,112,67],[112,68,112,76],[112,77,112,83],[112,84,112,91],[112,92,112,100],[112,101,112,107],[113,0,113,35],[113,36,113,43],[113,44,113,52],[113,53,113,59],[113,60,113,67],[113,68,113,76],[113,77,113,83],[113,84,113,91],[113,92,113,100],[113,101,113,107],[114,0,114,13],[114,14,114,16],[114,17,114,20],[114,21,114,23],[114,24,114,44],[114,45,114,82],[114,83,114,107],[115,0,115,107]]}
[]
[{"$nulls":3},"Schallschutz SIA-Norm 181 (2020) ",{"$nulls":46},"S",{"$nulls":7},"Schallschutznachweis\nAussenlärm"]
[{"$nulls":21},"Projektkontrolle"]
[]
["Gemeinde:",{"$nulls":13},"Zürich",{"$nulls":39},"Parz. Nr.:",{"$nulls":10},"AA1702",{"$nulls":12},"Geb. Nr.:"]
["Bauvorhaben:",{"$nulls":13},"Ersatzneubau"]
[]
[]
["Aussenlärmsituation (Beurteilungspegel)"]
[{"$nulls":3},"Strassenlärm:",{"$nulls":21},61,{"$nulls":5},"dB (Tag)",{"$nulls":14},58,{"$nulls":5},"dB (Nacht)",{"$nulls":13},"Maximaler Pegel auf der Nordseite"]
[{"$nulls":3},"Eisenbahnlärm:",{"$nulls":27},"dB (Tag)",{"$nulls":20},"dB (Nacht)"]
[{"$nulls":3},"Fluglärm:",{"$nulls":27},"dB (6-22 h)",{"$nulls":20},"dB (22-23 h)"]
[{"$nulls":3},"andere:"]
[{"$nulls":3},"keine spezifische Lärmquelle vorhanden"]
[]
[]
["Schutz gegen Aussenlärm",{"$nulls":60},"Siehe beiliegenden Schallschutznachweis"]
[]
["Situation",{"$nulls":35},"Situation 1",{"$nulls":23},"Situation 2",{"$nulls":23},"Situation 3"]
["Empfangsraum: ",{"$nulls":15},"Bezeichnung",{"$nulls":19},"Wohnzimmer",{"$nulls":23},"Schlafzimmer",{"$nulls":23},"Schlafzimmer"]
["                        ",{"$nulls":15},"Nr. / Geschoss",{"$nulls":19},"105 / EG",{"$nulls":23},"107 / EG",{"$nulls":23},"109 / EG"]
["Massgebende Lärmbelastung",{"$nulls":35},"Lr,Tag =",{"$nulls":7},61,{"$nulls":3},"Lr,Nacht =",{"$nulls":7},58,{"$nulls":3},"Lr,Tag =",{"$nulls":7},61,{"$nulls":3},"Lr,Nacht =",{"$nulls":7},58,{"$nulls":3},"Lr,Tag =",{"$nulls":7},54,{"$nulls":3},"Lr,Nacht =",{"$nulls":7},51]
["Lärmempfindlichkeit",{"$nulls":35},"mittel",{"$nulls":23},"mittel",{"$nulls":23},"mittel"]
["Massgebende Anforderung ",{"$nulls":35},"De =",{"$nulls":8},36,{"$nulls":5},"dB",{"$nulls":8},"De =",{"$nulls":8},36,{"$nulls":5},"dB",{"$nulls":8},"De =",{"$nulls":8},27,{"$nulls":5},"dB"]
["Trennbauteile",{"$nulls":35},"S [m2]",{"$nulls":7},"R'45°,w",{"$nulls":7},"Ctr [dB]",{"$nulls":7},"S [m2]",{"$nulls":7},"R'45°,w",{"$nulls":7},"Ctr [dB]",{"$nulls":7},"S [m2]",{"$nulls":7},"R'45°,w",{"$nulls":7},"Ctr [dB]"]
["BT1 AW 20 cm Beton + MW",{"$nulls":35},23.5,{"$nulls":7},{"v":57,"d":"57.0"},{"$nulls":7},{"v":-4,"d":"-4.0"},{"$nulls":7},16.5,{"$nulls":7},{"v":57,"d":"57.0"},{"$nulls":7},{"v":-4,"d":"-4.0"},{"$nulls":7},17.2,{"$nulls":7},{"v":57,"d":"57.0"},{"$nulls":7},{"v":-4,"d":"-4.0"}]
["BT2 Fenster Nord 2fach IV",{"$nulls":35},11.2,{"$nulls":7},{"v":40,"d":"40.0"},{"$nulls":7},{"v":-5,"d":"-5.0"},{"$nulls":7},8.1,{"$nulls":7},{"v":40,"d":"40.0"},{"$nulls":7},{"v":-5,"d":"-5.0"}]
["BT3 Fenster Süd 2fach IV",{"$nulls":83},8.1,{"$nulls":7},{"v":30,"d":"30.0"},{"$nulls":7},{"v":-5,"d":"-5.0"}]
[]
[]
[]
[]
[]
["Sres und (R'45°,w + Ctr)res",{"$nulls":35},{"$f":"SUM(AK26:AR33)","v":34.7},{"$nulls":7},{"$f":"IF(AK34>0,ROUND(-10*LOG(\n(AK26*10^((ROUND(-AS26-BA26,1))/10)\n+AK27*10^((ROUND(-AS27-BA27,1))/10)\n+AK28*10^((ROUND(-AS28-BA28,1))/10)\n+AK29*10^((ROUND(-AS29-BA29,1))/10)\n+AK30*10^((ROUND(-AS30-BA30,1))/10)\n+AK31*10^((ROUND(-AS31-BA31,1))/10)\n+AK32*10^((ROUND(-AS32-BA32,1))/10)\n+AK33*10^((ROUND(-AS33-BA33,1))/10)\n)/AK34),1),0)","v":39.8},{"$nulls":15},{"$f":"SUM(BI26:BP33)","v":24.6},{"$nulls":7},{"$f":"IF(BI34>0,ROUND(-10*LOG(\n(BI26*10^((ROUND(-BQ26-BY26,1))/10)\n+BI27*10^((ROUND(-BQ27-BY27,1))/10)\n+BI28*10^((ROUND(-BQ28-BY28,1))/10)\n+BI29*10^((ROUND(-BQ29-BY29,1))/10)\n+BI30*10^((ROUND(-BQ30-BY30,1))/10)\n+BI31*10^((ROUND(-BQ31-BY31,1))/10)\n+BI32*10^((ROUND(-BQ32-BY32,1))/10)\n+BI33*10^((ROUND(-BQ33-BY33,1))/10)\n)/BI34),1),0)","v":39.7},{"$nulls":15},{"$f":"SUM(CG26:CN33)","v":{"v":25.299999999999997,"d":"25.3"}},{"$nulls":7},{"$f":"IF(CG34>0,ROUND(-10*LOG(\n(CG26*10^((ROUND(-CO26-CW26,1))/10)\n+CG27*10^((ROUND(-CO27-CW27,1))/10)\n+CG28*10^((ROUND(-CO28-CW28,1))/10)\n+CG29*10^((ROUND(-CO29-CW29,1))/10)\n+CG30*10^((ROUND(-CO30-CW30,1))/10)\n+CG31*10^((ROUND(-CO31-CW31,1))/10)\n+CG32*10^((ROUND(-CO32-CW32,1))/10)\n+CG33*10^((ROUND(-CO33-CW33,1))/10)\n)/CG34),1),0)","v":29.9}]
["Volumen Empfangsraum",{"$nulls":35},"V =",{"$nulls":7},78.9,{"$nulls":7},"m3",{"$nulls":7},"V =",{"$nulls":7},52.6,{"$nulls":7},"m3",{"$nulls":7},"V =",{"$nulls":7},66.4,{"$nulls":7},"m3"]
["Projektierungszuschlag Kp",{"$nulls":35},"Kp =",{"$nulls":7},{"v":2,"d":"2.0"},{"$nulls":7},"dB",{"$nulls":7},"Kp =",{"$nulls":7},{"v":2,"d":"2.0"},{"$nulls":7},"dB",{"$nulls":7},"Kp =",{"$nulls":7},{"v":2,"d":"2.0"},{"$nulls":7},"dB"]
["Ermittelter Schallschutz",{"$nulls":35},"De,d =",{"$nulls":7},{"$f":"IF(AND(AK34>0,AS34>0,AS35>0),ROUND(AS34+10*LOG(AS35/AK34)-4.9-AS36,1),0)","v":36.5},{"$nulls":8},"dB",{"$nulls":6},"De,d =",{"$nulls":7},{"$f":"IF(AND(BI34>0,BQ34>0,BQ35>0),ROUND(BQ34+10*LOG(BQ35/BI34)-4.9-BQ36,1),0)","v":36.1},{"$nulls":8},"dB",{"$nulls":6},"De,d =",{"$nulls":7},{"$f":"IF(AND(CG34>0,CO34>0,CO35>0),ROUND(CO34+10*LOG(CO35/CG34)-4.9-CO36,1),0)","v":27.2},{"$nulls":8},"dB"]
["Erfüllt ",{"$nulls":43},{"$f":"IF(AND(AT24>0,AS37>0),IF(AND(AT24<=AS37,AS34>=AT24-5),\"Ja\",\"Nein\"),\"\")","v":"Ja"},{"$nulls":23},{"$f":"IF(AND(BR24>0,BQ37>0),IF(AND(BR24<=BQ37,BQ34>=BR24-5),\"Ja\",\"Nein\"),\"\")","v":"Ja"},{"$nulls":23},{"$f":"IF(AND(CP24>0,CO37>0),IF(AND(CP24<=CO37,CO34>=CP24-5),\"Ja\",\"Nein\"),\"\")","v":"Ja"}]
[]
["Unterschriften:"]
["Das Projekt erfüllt Anforderungen der SIA-Norm 181:2020 gemäss Art. 32 LSV (Aussenlärm, Innenlärm, gebäudetech-"]
["nische Anlagen, Schallschutz gegenüber Musiklokalen):",{"$nulls":94},"ja",{"$nulls":6},"nein"]
[]
[{"$nulls":23},"Nachweis erarbeitet durch:",{"$nulls":43},"Private Kontrolle / Nachweisprüfung:\nDie Vollständigkeit und die Richtigkeit\nbescheinigt:"]
["Name und Adresse,\nbzw. Firmenstempel:"]
[]
[]
["Sachbearbeiter/in, Tel.:"]
["Ort, Datum, Unterschrift:"]
[{"$nulls":67},"Ausführungskontrolle:",{"$nulls":25},"gleiche Person"]
[{"$nulls":67},"oder :"]
[]
["Formular S Seite ",{"$nulls":13},1,null,null,"von",{"$nulls":3},3,{"$nulls":23},"Formular S",{"$nulls":37},"Version vom 30. November 2020"]
[]
[{"$nulls":3},"Schallschutz SIA-Norm 181 (2020) ",{"$nulls":46},"S",{"$nulls":7},"Schallschutznachweis\nInnenlärm"]
[{"$nulls":21},"Projektkontrolle"]
[]
[{"$nulls":4},"Nur eine Nutzungseinheit: Schallschutznachweis für Innenlärm nicht notwendig"]
[]
[]
["Luftschall",{"$nulls":60},"Siehe beiliegenden Schallschutznachweis"]
[]
["Situation",{"$nulls":35},"Situation 4",{"$nulls":23},"Situation 5",{"$nulls":23},"Situation 6"]
["Trennbauteil",{"$nulls":35},"Wohnungstrenndecke",{"$nulls":23},"Wohnungstrennwand",{"$nulls":23},"Whg.-Trennwand Eingang"]
["Senderaum: ",{"$nulls":15},"Bezeichnung",{"$nulls":19},"Schlafzimmer",{"$nulls":23},"Schlafzimmer",{"$nulls":23},"Treppenhaus"]
["                        ",{"$nulls":15},"Nr. / Geschoss",{"$nulls":19},"207 / OG1",{"$nulls":23},"207 / OG1",{"$nulls":23},"109 / EG"]
["Empfangsraum: ",{"$nulls":15},"Bezeichnung",{"$nulls":19},"Schlafzimmer",{"$nulls":23},"Zimmer",{"$nulls":23},"Wohnzimmer "]
["                        ",{"$nulls":15},"Nr. / Geschoss",{"$nulls":19},"107 / EG",{"$nulls":23},"215 / OG1",{"$nulls":23},"105 / EG"]
["Grad der Störung",{"$nulls":35},"mässig",{"$nulls":23},"mässig",{"$nulls":23},"mässig"]
["Lärmempfindlichkeit",{"$nulls":35},"mittel",{"$nulls":23},"mittel",{"$nulls":23},"mittel"]
["Abschlusstüre Ziffer 3.2.2.1",{"$nulls":38},"R'W + C ≥",{"$nulls":15},"dB",{"$nulls":4},10,null,null,"R'W + C ≥",{"$nulls":15},"dB",{"$nulls":4},10,null,null,"R'W + C ≥",{"$nulls":10},37,{"$nulls":4},"dB"]
["Tieffreq. Emi. nachts Ziffer 3.2.2.2",{"$nulls":38},"tieffreq. in der Nacht",{"$nulls":20},10,null,null,"tieffreq. in der Nacht",{"$nulls":20},10,null,null,"tieffreq. in der Nacht"]
["Massgebende Anforderung ",{"$nulls":35},"Di =",{"$nulls":8},52,{"$nulls":5},"dB",{"$nulls":8},"Di =",{"$nulls":8},52,{"$nulls":5},"dB",{"$nulls":8},"Di =",{"$nulls":8},47,{"$nulls":5},"dB"]
["Trennbauteile",{"$nulls":35},"S [m2]",{"$nulls":7},"R'w [dB]",{"$nulls":7},"C [dB]",{"$nulls":7},"S [m2]",{"$nulls":7},"R'w [dB]",{"$nulls":7},"C [dB]",{"$nulls":7},"S [m2]",{"$nulls":7},"R'w [dB]",{"$nulls":7},"C [dB]"]
["BT4 Innenwand Beton 20 cm",{"$nulls":59},10.2,{"$nulls":7},{"v":57,"d":"57.0"},{"$nulls":7},{"v":-2,"d":"-2.0"},{"$nulls":7},{"v":12,"d":"12.0"},{"$nulls":7},{"v":57,"d":"57.0"},{"$nulls":7},{"v":-2,"d":"-2.0"}]
["BT5 Decke 22cm Beton + TSD + UB",{"$nulls":35},{"v":17,"d":"17.0"},{"$nulls":7},{"v":58,"d":"58.0"},{"$nulls":7},{"v":-2,"d":"-2.0"}]
["BT6 Wohnungseingangstüre",{"$nulls":83},{"v":2,"d":"2.0"},{"$nulls":7},{"v":42,"d":"42.0"},{"$nulls":7},{"v":-5,"d":"-5.0"}]
[]
[]
[]
[]
[]
["Sres und (R'w + C)res",{"$nulls":35},{"$f":"SUM(AK75:AR82)","v":{"v":17,"d":"17.0"}},{"$nulls":7},{"$f":"IF(AK83>0,ROUND(-10*LOG(\n(AK75*10^((ROUND(-AS75-BA75,1))/10)\n+AK76*10^((ROUND(-AS76-BA76,1))/10)\n+AK77*10^((ROUND(-AS77-BA77,1))/10)\n+AK78*10^((ROUND(-AS78-BA78,1))/10)\n+AK79*10^((ROUND(-AS79-BA79,1))/10)\n+AK80*10^((ROUND(-AS80-BA80,1))/10)\n+AK81*10^((ROUND(-AS81-BA81,1))/10)\n+AK82*10^((ROUND(-AS82-BA82,1))/10)\n)/AK83),1),0)","v":{"v":56,"d":"56.0"}},{"$nulls":15},{"$f":"SUM(BI75:BP82)","v":10.2},{"$nulls":7},{"$f":"IF(BI83>0,ROUND(-10*LOG(\n(BI75*10^((ROUND(-BQ75-BY75,1))/10)\n+BI76*10^((ROUND(-BQ76-BY76,1))/10)\n+BI77*10^((ROUND(-BQ77-BY77,1))/10)\n+BI78*10^((ROUND(-BQ78-BY78,1))/10)\n+BI79*10^((ROUND(-BQ79-BY79,1))/10)\n+BI80*10^((ROUND(-BQ80-BY80,1))/10)\n+BI81*10^((ROUND(-BQ81-BY81,1))/10)\n+BI82*10^((ROUND(-BQ82-BY82,1))/10)\n)/BI83),1),0)","v":{"v":55,"d":"55.0"}},{"$nulls":15},{"$f":"SUM(CG75:CN82)","v":{"v":14,"d":"14.0"}},{"$nulls":7},{"$f":"IF(CG83>0,ROUND(-10*LOG(\n(CG75*10^((ROUND(-CO75-CW75,1))/10)\n+CG76*10^((ROUND(-CO76-CW76,1))/10)\n+CG77*10^((ROUND(-CO77-CW77,1))/10)\n+CG78*10^((ROUND(-CO78-CW78,1))/10)\n+CG79*10^((ROUND(-CO79-CW79,1))/10)\n+CG80*10^((ROUND(-CO80-CW80,1))/10)\n+CG81*10^((ROUND(-CO81-CW81,1))/10)\n+CG82*10^((ROUND(-CO82-CW82,1))/10)\n)/CG83),1),0)","v":45.1}]
["Volumen Empfangsraum",{"$nulls":35},"V =",{"$nulls":7},52.6,{"$nulls":7},"m3",{"$nulls":7},"V =",{"$nulls":7},40.3,{"$nulls":7},"m3",{"$nulls":7},"V =",{"$nulls":7},78.9,{"$nulls":7},"m3"]
["Projektierungszuschlag Kp",{"$nulls":35},"Kp =",{"$nulls":7},{"v":2,"d":"2.0"},{"$nulls":7},"dB",{"$nulls":7},"Kp =",{"$nulls":7},{"v":2,"d":"2.0"},{"$nulls":7},"dB",{"$nulls":7},"Kp =",{"$nulls":7},{"v":0,"d":"0.0"},{"$nulls":7},"dB"]
["Ermittelter Schallschutz",{"$nulls":35},"Di,d =",{"$nulls":7},{"$f":"IF(AND(AK83>0,AS83>0,AS84>0),ROUND(AS83+10*LOG(AS84/AK83)-4.9-AS85,1),0)","v":{"v":54,"d":"54.0"}},{"$nulls":8},"dB",{"$nulls":6},"Di,d =",{"$nulls":7},{"$f":"IF(AND(BI83>0,BQ83>0,BQ84>0),ROUND(BQ83+10*LOG(BQ84/BI83)-4.9-BQ85,1),0)","v":54.1},{"$nulls":8},"dB",{"$nulls":6},"Di,d =",{"$nulls":7},{"$f":"IF(AND(CG83>0,CO83>0,CO84>0),ROUND(CO83+10*LOG(CO84/CG83)-4.9-CO85,1),0)","v":47.7},{"$nulls":8},"dB"]
["Erfüllt ",{"$nulls":43},{"$f":"IF(AND(AT73>0,AS86>0),\nIF(AND(AT73<=AS86,IF($AY$18>0,\nAND(IF(AS75>0,$AS$22+$BA$22>=$AY$18,\nIF(AS76>0,$AS$23+$BA$23>=$AY$18,\nIF(AS77>0,$AS$24+$BA$24>=$AY$18,\nIF(AS78>0,$AS$25+$BA$25>=$AY$18,\nIF(AS79>0,$AS$26+$BA$26>=$AY$18,\nIF(AS80>0,$AS$27+$BA$27>=$AY$18,\nIF(AS81>0,$AS$28+$BA$28>=$AY$18,\nIF(AS82>0,$AS$29+$BA$29>=$AY$18,TRUE)))))))),\nIF(AS76>0,$AS$23+$BA$23>=$AY$18,TRUE),\nIF(AS77>0,$AS$24+$BA$24>=$AY$18,TRUE),\nIF(AS78>0,$AS$25+$BA$25>=$AY$18,TRUE),\nIF(AS79>0,$AS$26+$BA$26>=$AY$18,TRUE),\nIF(AS80>0,$AS$27+$BA$27>=$AY$18,TRUE),\nIF(AS81>0,$AS$28+$BA$28>=$AY$18,TRUE),\nIF(AS82>0,$AS$29+$BA$29>=$AY$18,TRUE)),\n$AT$20-5<=$AS$30)),\"Ja\",\"Nein\"),\"\")","v":"Ja"},{"$nulls":23},{"$f":"IF(AND(BR73>0,BQ86>0),\nIF(AND(BR73<=BQ86,IF(BW71>0,\nAND(IF(BQ75>0,BQ75+BY75>=BW71,\nIF(BQ76>0,BQ76+BY76>=BW71,\nIF(BQ77>0,BQ77+BY77>=BW71,\nIF(BQ78>0,BQ78+BY78>=BW71,\nIF(BQ79>0,BQ79+BY79>=BW71,\nIF(BQ80>0,BQ80+BY80>=BW71,\nIF(BQ81>0,BQ81+BY81>=BW71,\nIF(BQ82>0,BQ82+BY82>=BW71,TRUE)))))))),\nIF(BQ76>0,BQ76+BY76>=BW71,TRUE),\nIF(BQ77>0,BQ77+BY77>=BW71,TRUE),\nIF(BQ78>0,BQ78+BY78>=BW71,TRUE),\nIF(BQ79>0,BQ79+BY79>=BW71,TRUE),\nIF(BQ80>0,BQ80+BY80>=BW71,TRUE),\nIF(BQ81>0,BQ81+BY81>=BW71,TRUE),\nIF(BQ82>0,BQ82+BY82>=BW71,TRUE)),\nBR73-5<=BQ83)),\"Ja\",\"Nein\"),\"\")","v":"Ja"},{"$nulls":23},{"$f":"IF(AND(CP73>0,CO86>0),\nIF(AND(CP73<=CO86,IF(CU71>0,\nAND(IF(CO75>0,CO75+CW75>=CU71,\nIF(CO76>0,CO76+CW76>=CU71,\nIF(CO77>0,CO77+CW77>=CU71,\nIF(CO78>0,CO78+CW78>=CU71,\nIF(CO79>0,CO79+CW79>=CU71,\nIF(CO80>0,CO80+CW80>=CU71,\nIF(CO81>0,CO81+CW81>=CU71,\nIF(CO82>0,CO82+CW82>=CU71,TRUE)))))))),\nIF(CO76>0,CO76+CW76>=CU71,TRUE),\nIF(CO77>0,CO77+CW77>=CU71,TRUE),\nIF(CO78>0,CO78+CW78>=CU71,TRUE),\nIF(CO79>0,CO79+CW79>=CU71,TRUE),\nIF(CO80>0,CO80+CW80>=CU71,TRUE),\nIF(CO81>0,CO81+CW81>=CU71,TRUE),\nIF(CO82>0,CO82+CW82>=CU71,TRUE)),\nCP73-5<=CO83)),\"Ja\",\"Nein\"),\"\")","v":"Ja"}]
[]
["Trittschall",{"$nulls":60},"Siehe beiliegenden Schallschutznachweis"]
[]
["Situation",{"$nulls":35},"Situation 4"]
["Trennbauteil",{"$nulls":35},"Wohnungstrenndecke"]
["Senderaum: ",{"$nulls":15},"Bezeichnung",{"$nulls":19},"Schlafzimmer"]
["                        ",{"$nulls":15},"Nr. / Geschoss",{"$nulls":19},"207 / OG1"]
["Empfangsraum: ",{"$nulls":15},"Bezeichnung",{"$nulls":19},"Schlafzimmer"]
["                        ",{"$nulls":15},"Nr. / Geschoss",{"$nulls":19},"107 / EG"]
["Grad der Störung",{"$nulls":35},"mässig"]
["Lärmempfindlichkeit",{"$nulls":35},"mittel"]
["Spezielle Fälle 3.3.2 ff",{"$nulls":38},"Umbau",{"$nulls":11},"Balkon",{"$nulls":11},"Umbau",{"$nulls":11},"Balkon",{"$nulls":11},"Umbau",{"$nulls":11},"Balkon"]
["Massgebende Anforderung ",{"$nulls":35},"L' =",{"$nulls":8},53,{"$nulls":5},"dB",{"$nulls":8},"L' =",{"$nulls":14},"dB",{"$nulls":8},"L' =",{"$nulls":14},"dB"]
[]
["Trennbauteile",{"$nulls":35},"d [cm]",{"$nulls":5},"L'n,w",{"$nulls":5},"DLW",{"$nulls":5},"CI",{"$nulls":5},"d [cm]",{"$nulls":5},"L'n,w",{"$nulls":5},"DLW",{"$nulls":5},"CI",{"$nulls":5},"d [cm]",{"$nulls":5},"L'n,w",{"$nulls":5},"DLW",{"$nulls":5},"CI"]
["BT5 Decke 22 cm Beton",{"$nulls":35},{"v":22,"d":"22.0"},{"$nulls":5},{"v":69,"d":"69.0"},{"$nulls":5},"-----",{"$nulls":5},{"v":2,"d":"2.0"},{"$nulls":17},"-----",{"$nulls":23},"-----"]
["       Trittschalldämmung + UB",{"$nulls":47},{"v":23,"d":"23.0"}]
[]
[]
[]
[]
[]
["Wert für gesamten Aufbau",{"$nulls":35},"L'n,w + CI =",{"$nulls":11},{"$f":"ROUND(SUM(AQ103:AV109) + IF(BC103>0, BC103,0) + IF(BC104>0, BC104,0) + IF(BC105>0, BC105,0) + IF(BC106>0, BC106,0) + IF(BC107>0, BC107,0) + IF(BC108>0, BC108,0) + IF(BC109>0, BC109,0) - SUM(AW104:BB109),1)","v":{"v":48,"d":"48.0"}},{"$nulls":6},"dB",{"$nulls":4},"L'n,w + CI =",{"$nulls":18},"dB",{"$nulls":4},"L'n,w + CI =",{"$nulls":18},"dB"]
["Volumen Empfangsraum",{"$nulls":35},"V =",{"$nulls":7},{"v":52,"d":"52.0"},{"$nulls":8},"m3",{"$nulls":6},"V =",{"$nulls":16},"m3",{"$nulls":6},"V =",{"$nulls":16},"m3"]
["Projektierungszuschlag Kp",{"$nulls":35},"Kp =",{"$nulls":7},{"v":5,"d":"5.0"},{"$nulls":8},"dB",{"$nulls":6},"Kp =",{"$nulls":7},{"v":5,"d":"5.0"},{"$nulls":8},"dB",{"$nulls":6},"Kp =",{"$nulls":7},{"v":5,"d":"5.0"},{"$nulls":8},"dB"]
["Ermittelter Schallpegel",{"$nulls":35},"L'd =",{"$nulls":7},{"$f":"IF(AND(AW110>0,AS111>0),ROUND((AW110-10*LOG(AS111)+14.9+AS112),1),0)","v":50.7},{"$nulls":8},"dB",{"$nulls":6},"L'd =",{"$nulls":16},"dB",{"$nulls":6},"L'd =",{"$nulls":16},"dB"]
["Erfüllt",{"$nulls":43},{"$f":"IF(AND(AT100>0,AW110>0,AS111>0),IF(AT100<AS113,\"Nein\",\"Ja\"),\"\")","v":"Ja"},{"$nulls":23},{"$f":"IF(AND(BR100>0,BU110>0,BQ111>0),IF(BR100<BQ113,\"Nein\",\"Ja\"),\"\")","v":""},{"$nulls":23},{"$f":"IF(AND(CP100>0,CS110>0,CO111>0),IF(CP100<CO113,\"Nein\",\"Ja\"),\"\")","v":""}]
["Formular S Seite ",{"$nulls":13},2,null,null,"von",{"$nulls":3},3,{"$nulls":23},"Formular S",{"$nulls":37},"Version vom 30. November 2020"]