{"text_format":"1","workbook":"xlsx","n_sheets":5,"sheets":["Anleitung-Hilfe","Luft-Wasser-WP","Erdsonden-WP","Kartenliste","Log-Journal"],"not_rendered":{"charts":0,"images":26,"macros":1,"external_links":1,"defined_names":76,"comments":0,"pivot_tables":0},"unopened":[],"bounds":{"document_bytes":16777216,"sheet_cells":100000,"rows_first":2000,"rows_last":500,"rows_between":2000,"halvings":0,"cell_chars":16384,"cell_head_chars":4096},"cells_cut":0,"cells_raw":0,"read":"whole","date_system":"1900"}

{"sheet":"Anleitung-Hilfe","index":0,"n_rows":16,"n_cols":1,"rows_kept":16,"cut":false,"hidden":false,"merged":[[15,0,15,7],[14,0,14,7],[0,0,0,7],[12,0,12,7],[13,0,13,7],[3,0,3,7],[4,0,4,7],[5,0,5,7],[6,0,6,7],[10,0,10,7],[11,0,11,7],[2,0,2,7],[8,0,8,7],[9,0,9,7]]}
["Anleitung und Hilfe zu diesem Excel"]
[]
["Was soll das Tool?"]
["Dieses Hilfsmittel soll unterstützen, wenn ein Gesuch für eine Wärmepumpe eingereicht werden soll."]
["Dieses Tool unterstützt bei der Anwendung der Karten des GIS Kanton Zürich. "]
["Dieses Tool hilft mit einer Sammlung von Links. Diese sollen möglichst direkt zu den nötigen Abklärungen führen."]
["Das Tool zeigt damit auch, auf welche Karten die Planenden einen Blick werfen sollten."]
[]
["Tipps zur Anwendung und \"warum\" es so erstellt wurde, wie es ist?"]
["Für die Anwendung dieses Tools sind drei Tabellenblätter nötig: «Anleitung-Hilfe», «Luft-Wasser-WP», «Ersonden-WP». Die weiteren Tabellenblätter legen die Programmierung offen. Damit die Koordinaten über das eidg. GWR (über https://map.geo.admin.ch/) abgefragt und später die Karten dargestellt werden können, müssen die \"Inhalte aktiviert\" (Webtools, Makro) werden. "]
["Nach der Eingabe einer Gebäudeadresse wird aus dem GWR (eidg. Gebäude und Wohnungsregister) der EGID und die Koordinaten abgefragt. Wenn das Gebäude nicht gefunden wird, können in den Feldern unten die Koordinaten von Hand definiert werden. Tipp: Zuerst die Schreibweise von Adresse und Ort ändern (Empfehlung: Strasse Nummer PLZ ORT ohne Kommas). "]
["Bei Luft/Wasser-Wärmepumpen ist für die Standortkoordinaten der Mittelpunkt der Wärmepumpe einzugeben. Für die Länge wird angenommen, dass diese in der X-Achsen-Richtung steht, die Breite in der Y-Achsen-Richtung. Mit dem Winkel kann das Gerät gedreht werden, die Eingabe erfolgt in Grad ohne °-Zeichen(z.B. \"90\"). Die Eingabe ist nicht eingeschränkt. Anstelle von 350° kann auch -10° eingegeben werden. Mit diesen Angaben wird das Gerät in den Karten eingezeichnet, die mit den Links aufgerufen werden können."]
["Bei Erdsonden-Wärmepumpen können bis zu 20 Erdsonden eingegeben werden. Mit diesen Angaben werden die Erdsonden in den Karten eingezeichnet, die mit den Links aufgerufen werden können."]
["Wenn in der Spalte Links der Wert \"anschauen\" steht, kann die Karte damit aufgerufen werden. Dies benötigt keine Makros. Excel erlauft in der Funktion Hyperlink nur 255 Zeichen lange Links. Wenn auch Koordinaten einer Wärmepumpe oder von Erdsonden mitaufgerufen werden, dann kann die Linklänge 255 Zeichen überschreiten. Deshalb gibt es neben jedem Link auch noch einen Befehlsknopf zum Aufrufen der Karte. Diese benötigt aber ein Makro. Damit dieses Makro aufgerufen werden kann, müssen in Excel die Makros freigegeben werden (das erfolgt meist irgendwo bei den Exceleinstellungen). Ohne Freigabe werden die Befehlsknöpfe ignoriert. Manchmal erscheinen auch Sicherheitswarnungen, weil der Aufruf von externen Webseiten zu Viren-verseuchten Seiten führen könnte. Die hier programmierten Links gehen zur Webseite des kantonalen GIS und beginnen mit \"https://maps.zh.ch/?\"."]
["Wenn die Links nicht gehen: Die in der Spalte «Link für Makro» angezeigten Links (der Anfang…) können mit «ctrl»+«c» kopiert werden und im Browser mit «ctrl»+«v» in die Adresszeile eingefügt werden. Nach drücken der Enter-Taste wird die Webseite des kantonalen GIS gestartet und die Karte im GIS angezeigt. Das Makro macht nichts anderes als genau das  (Code ist einsehbar)."]
["Bitte melden Sie uns Fehler und nicht funktionierende Links. Sowohl beim kantonalen GIS als auch beim Swisstopo können Änderungen an einem Service vorgenommen werden, welche eine Anpassung der Links erfordern. Bitte melden Sie solche Änderungen mit einem Printscreen, der zeigt, was nicht mehr geht (E-Mail: christoph.gmuer@bd.zh.ch)."]

{"sheet":"Luft-Wasser-WP","index":1,"n_rows":64,"n_cols":22,"rows_kept":64,"cut":false,"hidden":false,"merged":[[6,2,6,6],[9,5,9,6]]}
["Kanton Zürich",null,null,null,null,"Version: ",{"$f":"'Log-Journal'!E2","v":"V_1.1"},null,null,null,null,null,null,"Bereich mit Berechnungen"]
["Bewilligung von Wärmepumpen",null,null,null,null,"gültig bis:",{"$f":"'Log-Journal'!E3","v":"2024-07-31"}]
["Hilfsmittel zur Erstellung von Kartenauszügen mit dem kantonalen GIS "]
[]
[]
["Gebäude suchen"]
["Adresse eingeben:",null,null,null,null,null,null,null,null,null,null,null,null,"Daten aus GWR"]
[null,null,null,null,null,null,null,null,null,null,null,null,null,"Webseite GWR?",{"$f":"IF($C7=\"\",\"\",_xlfn.WEBSERVICE(CONCATENATE(\"https://api3.geo.admin.ch/rest/services/api/SearchServer?searchText=\",$C7,\"&origins=address&type=locations\")))","v":""}]
["GWR-Webseite",null,{"$f":"IF($O8=\"\",\"\",IF(ISNUMBER(SEARCH(\"[]\",$O8)),\"Adresse nicht eindeutig\",\"Gebäude gefunden\"))","v":""},{"$f":"IF($O8=\"\",\"\",IF(ISNUMBER(SEARCH(\"[]\",$O8)),\" \",HYPERLINK(CONCATENATE(\"https://map.geo.admin.ch/?layers=ch.bfs.gebaeude_wohnungs_register&X=\",O10,\"&Y=\",O9,\"&zoom=10&crosshair=circle\"),\"Karte anschauen\")))","v":""},null,"Quelle: GWR",null,null,null,null,null,null,null,"Ost-Koordinate",{"$f":"IF($O8=\"\",\"\",IF(ISNUMBER(SEARCH(\"[]\",$O8)),\"Adresse nicht eindeutig\",MID($O8,Q9,S9)))","v":""},null,{"$f":"SEARCH(\"\"\"y\"\":\",$O8)+4","v":{"$error":"#VALUE!"}},{"$f":"SEARCHB(\",\",$O8,Q9+1)","v":{"$error":"#VALUE!"}},{"$f":"R9-Q9","v":{"$error":"#VALUE!"}}]
[null,null,null,null,null,"https://map.geo.admin.ch/",null,null,null,null,null,null,null,"Nord-Koordinate",{"$f":"IF($O8=\"\",\"\",IF(ISNUMBER(SEARCH(\"[]\",$O8)),\" \",MID($O8,Q10,S10)))","v":""},null,{"$f":"SEARCH(\"\"\"x\"\":\",$O8)+4","v":{"$error":"#VALUE!"}},{"$f":"SEARCHB(\",\",$O8,Q10+1)","v":{"$error":"#VALUE!"}},{"$f":"R10-Q10","v":{"$error":"#VALUE!"}}]
["Koordinaten",null,{"$f":"O9+2000000","v":{"$error":"#VALUE!"}},{"$f":"O10+1000000","v":{"$error":"#VALUE!"}},null,"Aktualisierung setzt",null,null,null,null,null,null,null,"EGID_EDID",{"$f":"IF($O8=\"\",\"\",IF(ISNUMBER(SEARCH(\"[]\",$O8)),\" \",MID($O8,SEARCH(\"featureId\",$O8)+12,S11)))","v":""},null,{"$f":"SEARCH(\"featureId\",$O8)+12","v":{"$error":"#VALUE!"}},{"$f":"SEARCHB(\",\",$O8,Q11+1)","v":{"$error":"#VALUE!"}},{"$f":"R11-Q11-1","v":{"$error":"#VALUE!"}}]
["EGID",null,{"$f":"VALUE(MID(O11,1,FIND(\"_\",O11,1)-1))","v":{"$error":"#VALUE!"}},{"$f":"VALUE(MID(O11,FIND(\"_\",O11,1)+1,3))","v":{"$error":"#VALUE!"}},null,"Internetverbindung voraus"]
[null,null,null,null,null,null,null,null,null,null,null,null,null,"Gebäude definieren:",null,"LSV:","Berechnung Abstand Lärmempfangspunkt"]
[null,null,{"$f":"IF(C7=\"\",\"\",IF(C9=\"Gebäude gefunden\",\"\",\"Gebäude im GWR nicht gefunden, Adresse ändern/ergänzen oder hier Koordinaten eingeben!\"))","v":""},null,null,null,null,null,null,null,null,null,null,"Ost-K",{"$f":"ROUND(IF(C16=\"\",C11,C16),1)","v":{"$error":"#VALUE!"}},"Ost-K",{"$f":"ROUND(IF(F19=\"\",C19+$G$20*SIN(RADIANS($G$21)),F19),1)","v":{"$error":"#VALUE!"}}]
["Gebäude ",null,"Keine Eingabe = Koordinaten von oben übernehmen.",null,null,null,null,null,null,null,null,null,null,"Nord-K",{"$f":"ROUND(IF(D16=\"\",D11,D16),1)","v":{"$error":"#VALUE!"}},"Nord-K",{"$f":"ROUND(IF(G19=\"\",D19+$G$20*COS(RADIANS($G$21)),G19),1)","v":{"$error":"#VALUE!"}}]
["Koordinaten",null,null,null,null,null,null,null,null,null,null,null,null,"Entfernung der WP vom Haus",null,null,"Berechnet mit Entfernung WP zu Lärm-Empfangspunkt"]
[null,null,"nach links bzw rechts","nach oben bzw. unten",null,null,null,null,null,null,null,null,null,"Distanz",{"$f":"SQRT((O14-C19)^2+(O15-D19)^2)","v":{"$error":"#VALUE!"}},"Dist.",{"$f":"ROUND(SQRT((Q14-C19)^2+(Q15-D19)^2),1)","v":{"$error":"#VALUE!"}},{"$f":"CONCATENATE(\"%2CLINESTRING(\",C19,\"%20\",D19,\"%2C\",Q14,\"%20\",Q15,\")\")","v":{"$error":"#VALUE!"}}]
["Wärmepumpe   Standort zum Haus:",null,null,null,null,"Lärmschutz-Empfangspunkt",null,null,null,null,null,null,null,"Masstab",{"$f":"IF(O17<100,500,1000)","v":{"$error":"#VALUE!"}},"Winkel",{"$f":"ROUND(DEGREES(ATAN2((Q15-D19),(Q14-C19))),0)","v":{"$error":"#VALUE!"}},{"$f":"IF(Q17=0,\"\",R17)","v":{"$error":"#VALUE!"}}]
["Koordinaten (Mittelpunkt)",null,{"$f":"C11+C18","v":{"$error":"#VALUE!"}},{"$f":"D11+D18","v":{"$error":"#VALUE!"}}]
["Länge / Breite [m]  der Wärmepumpe",null,null,null,null,"Distanz",null,null,null,null,null,null,null,"Koordinaten zeigen Standort der aussenaufgestellten Luft/Wasser-Wärmepumpe. Umrechnung Koordinaten: https://www.onlinemathe.de/forum/Rechteck-um-Mittelpunkt-drehen-Koordinaten"]
["Drehung [°] der Wärmepumpe",null,null,null,null,"Winkel: 0=N",null,null,null,null,null,null,null,"Ecke SW",{"$f":"-C20/2","v":0},{"$f":"-D20/2","v":0},{"$f":"O21*COS(RADIANS($C$21))+P21*SIN(RADIANS($C$21))","v":0},{"$f":"-O21*SIN(RADIANS($C$21))+P21*COS(RADIANS($C$21))","v":0},{"$f":"$C$19+Q21","v":{"$error":"#VALUE!"}},{"$f":"$D$19+R21","v":{"$error":"#VALUE!"}},{"$f":"ROUND(S21,1)","v":{"$error":"#VALUE!"}},{"$error":"#VALUE!"}]
["Massgebender Punkt für Schallnachweis",null,"Abstand von WP:",{"$f":"IF(G20<>\"\",G20,Q17)","v":{"$error":"#VALUE!"}},null,"Winkel:",{"$f":"IF(D22=0,\"\",IF(G21<>\"\",G21,Q18))","v":{"$error":"#VALUE!"}},null,null,null,null,null,null,"Ecke NW",{"$f":"-C20/2","v":0},{"$f":"+D20/2","v":0},{"$f":"O22*COS(RADIANS($C$21))+P22*SIN(RADIANS($C$21))","v":0},{"$f":"-O22*SIN(RADIANS($C$21))+P22*COS(RADIANS($C$21))","v":0},{"$f":"$C$19+Q22","v":{"$error":"#VALUE!"}},{"$f":"$D$19+R22","v":{"$error":"#VALUE!"}},{"$error":"#VALUE!"},{"$error":"#VALUE!"}]
[null,null,null,null,null,null,null,null,null,null,null,null,null,"Ecke NE",{"$f":"+C20/2","v":0},{"$f":"+D20/2","v":0},{"$f":"O23*COS(RADIANS($C$21))+P23*SIN(RADIANS($C$21))","v":0},{"$f":"-O23*SIN(RADIANS($C$21))+P23*COS(RADIANS($C$21))","v":0},{"$f":"$C$19+Q23","v":{"$error":"#VALUE!"}},{"$f":"$D$19+R23","v":{"$error":"#VALUE!"}},{"$error":"#VALUE!"},{"$error":"#VALUE!"}]
[null,null,null,null,null,null,null,null,null,null,null,null,null,"Ecke SE",{"$f":"+C20/2","v":0},{"$f":"-D20/2","v":0},{"$f":"O24*COS(RADIANS($C$21))+P24*SIN(RADIANS($C$21))","v":0},{"$f":"-O24*SIN(RADIANS($C$21))+P24*COS(RADIANS($C$21))","v":0},{"$f":"$C$19+Q24","v":{"$error":"#VALUE!"}},{"$f":"$D$19+R24","v":{"$error":"#VALUE!"}},{"$error":"#VALUE!"},{"$error":"#VALUE!"}]
["Karten",null,"Link (falls möglich)","Link für Makro:",null,"Makros einschalten!",null,null,null,null,null,null,null,"WP-String",{"$f":"CONCATENATE(\"&redlining=GEOMETRYCOLLECTION(POLYGON((\",U21,\"%20\",V21,\"%2C\",U22,\"%20\",V22,\"%2C\",U23,\"%20\",V23,\"%2C\",U24,\"%20\",V24,\"%2C\",U21,\"%20\",V21,\"))\",R18,\")\")","v":{"$error":"#VALUE!"}}]
[]
[]
[1,{"$f":"INDEX(Kartenliste!$A$5:$G$21,A28,3)","v":"Vermessung s/w"},{"$f":"HYPERLINK(CONCATENATE(\"https://maps.zh.ch?\",N28,\"&scale=\",$O$18,\"&x=\",$O$14,\"&y=\",$O$15,\"&srid=2056\",P28,\"&markers=ring\",$O$25),\" anschauen \")","v":{"$error":"#VALUE!"}},{"$f":"CONCATENATE(\"https://maps.zh.ch?\",N28,\"&scale=\",$O$18,\"&x=\",$O$14,\"&y=\",$O$15,\"&srid=2056\",P28,\"&markers=ring\",$O$25)","v":{"$error":"#VALUE!"}}," ",null,null,null,null,null,null,null,null,{"$f":"INDEX(Kartenliste!$A$5:$G$21,A28,4)","v":"topic=AVswZH"},null,{"$f":"IF(INDEX(Kartenliste!$A$5:$G$21,A28,7)=\"J\",INDEX(Kartenliste!$A$5:$G$21,A28,5),\"\")","v":""}]
[]
[]
{"$rows_left_out":35}
{"sheet":"Erdsonden-WP","index":2,"n_rows":80,"n_cols":38,"rows_kept":80,"cut":false,"hidden":false,"merged":[[6,2,6,6],[9,5,9,6]]}
["Kanton Zürich",null,null,null,null,"Version: ",{"$f":"'Log-Journal'!E2","v":"V_1.1"},null,null,null,null,null,null,"Bereich mit Berechnungen"]
["Bewilligung von Wärmepumpen",null,null,null,null,"gültig bis:",{"$f":"'Log-Journal'!E3","v":"2024-07-31"}]
["Hilfsmittel zur Erstellung von Kartenauszügen mit dem kantonalen GIS "]
[]
[]
["Gebäude suchen"]
["Adresse eingeben:",null,null,null,null,null,null,null,null,null,null,null,null,"Daten aus GWR"]
[null,null,null,null,null,null,null,null,null,null,null,null,null,"Webseite GWR?",{"$f":"IF($C7=\"\",\"\",_xlfn.WEBSERVICE(CONCATENATE(\"https://api3.geo.admin.ch/rest/services/api/SearchServer?searchText=\",$C7,\"&origins=address&type=locations\")))","v":""}]
["GWR-Webseite",null,{"$f":"IF($O8=\"\",\"\",IF(ISNUMBER(SEARCH(\"[]\",$O8)),\"Adresse nicht eindeutig\",\"Gebäude gefunden\"))","v":""},{"$f":"IF($O8=\"\",\"\",IF(ISNUMBER(SEARCH(\"[]\",$O8)),\" \",HYPERLINK(CONCATENATE(\"https://map.geo.admin.ch/?layers=ch.bfs.gebaeude_wohnungs_register&X=\",O10,\"&Y=\",O9,\"&zoom=10&crosshair=circle\"),\"Karte anschauen\")))","v":""},null,"Quelle: GWR",null,null,null,null,null,null,null,"Ost-Koordinate",{"$f":"IF($O8=\"\",\"\",IF(ISNUMBER(SEARCH(\"[]\",$O8)),\"Adresse nicht eindeutig\",MID($O8,Q9,S9)))","v":""},null,{"$f":"SEARCH(\"\"\"y\"\":\",$O8)+4","v":{"$error":"#VALUE!"}},{"$f":"SEARCHB(\",\",$O8,Q9+1)","v":{"$error":"#VALUE!"}},{"$f":"R9-Q9","v":{"$error":"#VALUE!"}}]
[null,null,null,null,null,"https://map.geo.admin.ch/",null,null,null,null,null,null,null,"Nord-Koordinate",{"$f":"IF($O8=\"\",\"\",IF(ISNUMBER(SEARCH(\"[]\",$O8)),\" \",MID($O8,Q10,S10)))","v":""},null,{"$f":"SEARCH(\"\"\"x\"\":\",$O8)+4","v":{"$error":"#VALUE!"}},{"$f":"SEARCHB(\",\",$O8,Q10+1)","v":{"$error":"#VALUE!"}},{"$f":"R10-Q10","v":{"$error":"#VALUE!"}}]
["Koordinaten",null,{"$f":"O9+2000000","v":{"$error":"#VALUE!"}},{"$f":"O10+1000000","v":{"$error":"#VALUE!"}},null,"Aktualisierung setzt",null,null,null,null,null,null,null,"EGID_EDID",{"$f":"IF($O8=\"\",\"\",IF(ISNUMBER(SEARCH(\"[]\",$O8)),\" \",MID($O8,SEARCH(\"featureId\",$O8)+12,S11)))","v":""},null,{"$f":"SEARCH(\"featureId\",$O8)+12","v":{"$error":"#VALUE!"}},{"$f":"SEARCHB(\",\",$O8,Q11+1)","v":{"$error":"#VALUE!"}},{"$f":"R11-Q11-1","v":{"$error":"#VALUE!"}}]
["EGID",null,{"$f":"VALUE(MID(O11,1,FIND(\"_\",O11,1)-1))","v":{"$error":"#VALUE!"}},{"$f":"VALUE(MID(O11,FIND(\"_\",O11,1)+1,3))","v":{"$error":"#VALUE!"}},null,"Internetverbindung voraus"]
[null,null,null,null,null,null,null,null,null,null,null,null,null,"Gebäude definieren:"]
[null,null,{"$f":"IF(C7=\"\",\"\",IF(C9=\"Gebäude gefunden\",\"\",\"Gebäude im GWR nicht gefunden, Adresse ändern/ergänzen oder hier Koordinaten eingeben!\"))","v":""},null,null,null,null,null,null,null,null,null,null,"Ost-K",{"$f":"ROUND(IF(C16=\"\",C11,C16),1)","v":{"$error":"#VALUE!"}}]
["Gebäude ",null,"Keine Eingabe = Koordinaten von oben übernehmen.",null,null,null,null,null,null,null,null,null,null,"Nord-K",{"$f":"ROUND(IF(D16=\"\",D11,D16),1)","v":{"$error":"#VALUE!"}}]
["Koordinaten",null,null,null,null,null,null,null,null,null,null,null,null,"Entfernung der EWS1 vom Haus"]
[null,null,null,null,null,null,null,null,null,null,null,null,null,"Distanz"]
[null,null,null,null,null,null,null,null,null,null,null,null,null,"Masstab",{"$f":"IF(MAX(R20:AL39)<50,500,1000)","v":500},null,null,"Abstände:"]
["Erdsonden",null,null,null,null,null,null,null,null,null,null,null,null,"Koordinaten der Erdsonden als String",null,null,null,"Haus","ES 1","ES 2","ES 3","ES 4","ES 5","ES 6","ES 7","ES 8","ES 9","ES 10","ES 11","ES 12","ES 13","ES 14","ES 15","ES 16","ES 17","ES 18","ES 19","ES 20"]
["Koordinaten (Erdsonde 1)",null,null,null,null,null,null,null,null,null,null,null,null,"Erdsonde 1",{"$f":"ROUND(C20,1)","v":0},{"$f":"ROUND(D20,1)","v":0},{"$f":"IF(O20<1,\"\",CONCATENATE(\"POINT(\",O20,\"%20\",P20,\")\"))","v":""},{"$f":"IF(O20<1,0,SQRT(($O$14-C20)^2+($O$15-D20)^2))","v":0},{"$f":"IF(O20<1,0,SQRT(($C$20-C20)^2+($D$20-D20)^2))","v":0}]
["Koordinaten (Erdsonde 2)",null,null,null,null,null,null,null,null,null,null,null,null,"Erdsonde 2",{"$f":"ROUND(C21,1)","v":0},{"$f":"ROUND(D21,1)","v":0},{"$f":"IF(O21<1,\"\",CONCATENATE(\"%2CPOINT(\",O21,\"%20\",P21,\")\"))","v":""},0,{"$f":"IF(O21<1,0,SQRT(($C$20-C21)^2+($D$20-D21)^2))","v":0},{"$f":"IF(O21<1,0,SQRT(($C$21-C21)^2+($D$21-D21)^2))","v":0}]
["Koordinaten (Erdsonde 3)",null,null,null,null,null,null,null,null,null,null,null,null,"Erdsonde 3",0,0,"",0,0,0,{"$f":"IF(O22<1,0,SQRT(($C$22-C22)^2+($D$22-D22)^2))","v":0}]
["Koordinaten (Erdsonde 4)",null,null,null,null,null,null,null,null,null,null,null,null,"Erdsonde 4",0,0,"",0,0,0,0,{"$f":"IF(O23<1,0,SQRT(($C$23-C23)^2+($D$23-D23)^2))","v":0}]
["Koordinaten (Erdsonde 5)",null,null,null,null,null,null,null,null,null,null,null,null,"Erdsonde 5",0,0,"",0,0,0,0,0,{"$f":"IF(O24<1,0,SQRT(($C$24-C24)^2+($D$24-D24)^2))","v":0}]
["Koordinaten (Erdsonde 6)",null,null,null,null,null,null,null,null,null,null,null,null,"Erdsonde 6",0,0,"",0,0,0,0,0,0,{"$f":"IF(O25<1,0,SQRT(($C$25-C25)^2+($D$25-D25)^2))","v":0}]
["Koordinaten (Erdsonde 7)",null,null,null,null,null,null,null,null,null,null,null,null,"Erdsonde 7",0,0,"",0,0,0,0,0,0,0,{"$f":"IF(O26<1,0,SQRT(($C$26-C26)^2+($D$26-D26)^2))","v":0}]
["Koordinaten (Erdsonde 8)",null,null,null,null,null,null,null,null,null,null,null,null,"Erdsonde 8",0,0,"",0,0,0,0,0,0,0,0,{"$f":"IF(O27<1,0,SQRT(($C$27-C27)^2+($D$27-D27)^2))","v":0}]
["Koordinaten (Erdsonde 9)",null,null,null,null,null,null,null,null,null,null,null,null,"Erdsonde 9",0,0,{"$f":"IF(O28<1,\"\",CONCATENATE(\"%2CPOINT(\",O28,\"%20\",P28,\")\"))","v":""},{"$f":"IF(O28<1,0,SQRT(($O$14-C28)^2+($O$15-D28)^2))","v":0},0,0,0,0,0,0,0,0,{"$f":"IF(O28<1,0,SQRT(($C$28-C28)^2+($D$28-D28)^2))","v":0}]
["Koordinaten (Erdsonde 10)",null,null,null,null,null,null,null,null,null,null,null,null,"Erdsonde 10",{"$f":"ROUND(C29,1)","v":0},{"$f":"ROUND(D29,1)","v":0},{"$f":"IF(O29<1,\"\",CONCATENATE(\"%2CPOINT(\",O29,\"%20\",P29,\")\"))","v":""},0,0,0,0,0,0,0,0,0,0,{"$f":"IF(O29<1,0,SQRT(($C$29-C29)^2+($D$29-D29)^2))","v":0}]
["Koordinaten (Erdsonde 11)",null,null,null,null,null,null,null,null,null,null,null,null,"Erdsonde 11",0,0,"",0,0,0,0,0,0,0,0,0,0,0,{"$f":"IF(O30<1,0,SQRT(($C$30-C30)^2+($D$30-D30)^2))","v":0}]
{"$rows_left_out":51}
{"sheet":"Kartenliste","index":3,"n_rows":42,"n_cols":7,"rows_kept":42,"cut":false,"hidden":false,"merged":[]}
["Aufbereitete Links der möglichen Karten"]
[]
[]
["LW",null,"Karte:","Layername","Offlayers","Erklärung","OffL-JN"]
[1,"n","Vermessung s/w","topic=AVswZH",null,null,"N"]
[2,"i","Orthofoto","topic=ortho19ZH",null,null,"N"]
[3,"n","ÖREB Abstände","topic=ARPOerebZH","&offlayers=nutzungsplanung-gemeinden%2Claermempfindlichkeitsstufen%2Cgrundwasserschutzareale%2Cgrundwasserschutzzonen",null,"J"]
[4,"n","Lärm-Empfindlichkeit","topic=TBALaermuebersichtRPZH",null,null,"N"]
[5,"n","Staatsstrassen","topic=TBAZH","&offlayers=strasseneigentum%2Cweitere-strassenattribute%2Chaupt-und-nebenstrassen%2Ckilometrierung-rbbs%2Cbezirkslabels",null,"J"]
[6,"n","Gewässerabstand","topic=AwelWBwwwZH","&offlayers=bezirkslabels",null,"J"]
[7,"n","Ortsbild","topic=OrtsbildschutzZH",null,null,"N"]
[8,"n","Hochwasser/Wassertiefen HQ300","topic=AwelGKHWwassertiefen1ZH","&offlayers=wassertiefe-hq100%2Cwassertiefe-hq30%2Cintensitaetsflaechen-hochwasser-hq300%2Cintensitaetsflaechen-hochwasser-hq100%2Cintensitaetsflaechen-hochwasser-hq30%2Cseehochwasser-hq100%2Cseehochwasser-hq30%2Cwassertiefenpunkte-hq100-daten-vor-2006%2Clabels%2Cbezirkslabels","Gebäudeöffnungen bei innenaufg. WP oberhalb Schutzkote festlegen bzw. Sockel für aussen aufgestellte WP empfohlen","J"]
[9,"i","Vermessung farbig","topic=AVfarbigZH",null,null,"N"]
[10,"i","ÖREB Nutzungszonen","topic=ARPOerebZH",null,"Alle Layer eingeschaltet","N"]
[11,"i","ÖREB Empfindlichkeitsstufen","topic=ARPOerebZH","&offlayers=seen%2Cuebersichtskarte%2Cnutzungsplanung-gemeinden%2Cnutzungsplanung-legende%2Csondernutzungszonen-f-gemeinden%2Csondernutzungszonen-l-gemeinden%2Csondernutzungszonen-p-gemeinden%2Cgrundwasserschutzareale%2Cgrundwasserschutzzonen%2Cwaldabstandslinien%2Cwaldgrenzen%2Cgewaesserabstandslinien%2Cnutzungsplanung-beschriftung-gemeinden%2Cgrenzen%2Cgemeindegrenzen&onlayers=laermempfindlichkeitsstufen","Aussenlärmgutachten/Nachweis","J"]
[12,"i","Kommunaler Energieplan","topic=AWELkommEPZH",null,null,"N"]
[13,"i","Strassenlärm","topic=TBAStrassenlaermZH","&offlayers=flaechen-emissionen-san%2Clinien-emissionen-san","Informativ, keine Beurteilung durch Kanton","J"]
[null,null,"Arch/Denkmal:","topic=ArchDenkmalZH",null,null,"N"]
[null,"i","KbS","topic=AwelKBSZH",null,null,"N"]
[null,"i","Risikokarte","topic=AwelRKNGZH","&offlayers=steinschlag%2Cspont-rutschungen%2Cperm-rutschungen%2Changmuren%2Cmassenbewegungen%2Cbezirkslabels","Risikokarte braucht es nicht >> grobe Information und Übersicht","J"]
[null,"i","Wärmenutzungsatlas","topic=AwelGSWaermewwwZH","&offlayers=bezirkslabels","Zulässigkeit von Erdsonden abklären","J"]
[]
[]
["ES",null,"Karte:","Layername","Offlayers","Erklärung","OffL-JN"]
[1,"n","Vermessung s/w","topic=AVswZH",null,null,"N"]
[2,"i","Orthofoto","topic=ortho19ZH",null,null,"N"]
[3,"i","Wärmenutzungsatlas","topic=AwelGSWaermewwwZH","&offlayers=bezirkslabels","Zulässigkeit von Erdsonden abklären","J"]
[4,"n","ÖREB Abstände","topic=ARPOerebZH","&offlayers=nutzungsplanung-gemeinden%2Claermempfindlichkeitsstufen%2Cgrundwasserschutzareale%2Cgrundwasserschutzzonen",null,"J"]
[5,"n","Staatsstrassen","topic=TBAZH","&offlayers=strasseneigentum%2Cweitere-strassenattribute%2Chaupt-und-nebenstrassen%2Ckilometrierung-rbbs%2Cbezirkslabels",null,"J"]
[6,"n","Gewässerabstand","topic=AwelWBwwwZH","&offlayers=bezirkslabels",null,"J"]
{"$rows_left_out":13}
{"sheet":"Log-Journal","index":4,"n_rows":35,"n_cols":5,"rows_kept":35,"cut":false,"hidden":false,"merged":[]}
["Log-Journal zu dieser Datei"]
[null,null,null,"Version: ",{"$f":"VLOOKUP(C3,A4:E34,2)","v":"V_1.1"}]
["Letzte Revision:",null,{"$f":"MAX(A5:A34)","v":"2024-01-01"},"Gültig bis: ",{"$f":"VLOOKUP(C3,A4:E34,5)","v":"2024-07-31"}]
[]
["Datum","Version","Wer","Änderung","Form.gültig"]
["2021-08-06","V_0","CG","Sammlung von Links (April bis Juli)","2021-08-31"]
["2021-08-08","V_0.1","CG","Erste funktionsfähig Version, GWR-Anschluss programmiert","2021-08-31"]
["2021-08-15","V_0.2","CG","Kartenaufruf standardisiert","2021-08-31"]
["2021-09-22","V_0.3","CG","Befehl für Aufruf bei LW-WP an GIS-Änderung angepasst.","2021-09-22"]
["2021-09-24","V_0.4","CG","Karte Felstiefe bei den ES-WP ergänzt.","2021-09-24"]
["2022-01-18","V_0.5","CG","Anzahl Erdsonden auf 20 erhöht.","2022-01-31"]
["2022-05-08","V_0.6","CG","Schall-Linie bei Luft-Wasser-WP eingefügt.","2022-07-31"]
["2022-07-20","V_0.7","CG","Anpassung an geändertes GWR-Abfragetool (y-Koord.)","2022-08-31"]
["2022-09-26","V_0.8","CG","Anpassung an geändertes GWR-Abfragetool (x- und y-Koord.)","2022-10-31"]
["2022-10-06","V_0.9","CG","Anpassung Lärmschutzkarten (mit FALS)","2022-10-31"]
["2022-10-22","V_0.10","CG","Anleitung ergänzt. Anpassung GWR-Abfragetool (x,y,EGID)","2022-12-31"]
["2022-12-01","V_1","CG","Datei für die Publikation vorbereitet","2023-06-30"]
["2024-01-01","V_1","CG","Datum angepasst","2024-07-31"]
["2023-03-28","V_1.1","CG","Kommunaler Energieplan ergänzt.","2024-07-31"]
[]
[]
[]
[]
[]
[]
[]
[]
[]
[]
[]
{"$rows_left_out":5}