{"text_format":"1","workbook":"xlsx","n_sheets":10,"sheets":["Start","B Bericht","H Hochrechnung","L Leistungen und Kosten","C TN-Statistik Sprachkurs","C TN-Statistik Kurs allg.","C TN-Statistik Erstinfo","C TN-Statistik Beratung","AP","HT"],"not_rendered":{"charts":0,"images":1,"macros":1,"external_links":1,"defined_names":111,"comments":0,"pivot_tables":0},"unopened":[],"bounds":{"document_bytes":16777216,"sheet_cells":100000,"rows_first":2000,"rows_last":500,"rows_between":2000,"halvings":0,"cell_chars":16384,"cell_head_chars":4096},"cells_cut":0,"cells_raw":0,"read":"whole","date_system":"1900"}

{"sheet":"Start","index":0,"n_rows":37,"n_cols":13,"rows_kept":37,"cut":false,"hidden":false,"merged":[[36,2,36,3],[34,2,34,3],[35,2,35,3],[18,9,19,9],[30,5,30,7],[34,5,34,7],[3,10,6,10],[33,5,33,7],[11,2,11,7],[14,2,14,4],[15,2,15,4],[9,2,9,7],[10,2,10,6],[27,2,27,3],[28,2,28,3],[21,2,21,4],[22,2,22,4],[29,2,29,3],[30,2,30,3],[33,2,33,3]]}
[null,null,null,null,null,null,null,null,null,null,null,null,"X"]
[null,null,null,null,null,null,null,"Bitte Makros einschalten.",null,null,null,null,"ja"]
[null,null,null,null,null,null,null,null,null,null," "]
[null,null,null,null,null,null,null,null,null,null,null,null,"Migrantinnen / Migranten"]
[null,null,null,null,null,null,null,null,null,null,null,null,{"$f":"IF(M4=\"Migrantinnen / Migranten\", \"A\",\"Flü\")","v":"A"}]
[null,null,null,null,null,null,null,{"$f":"HT!C1","v":"2023-11-23"}]
[]
[null,{"$f":"IF(M18=FALSE,\"Reporting (KIP 2bis) - allgemeine Angaben zu LV-Nr.\",\"Hochrechnung (KIP 2bis) - allgemeine Angaben zu LV-Nr.\")","v":"Reporting (KIP 2bis) - allgemeine Angaben zu LV-Nr."},null,null,null,null,null,"(bitte auswählen)"]
[]
[null,"Jahr"]
{"$rows_left_out":28}
{"sheet":"B Bericht","index":1,"n_rows":58,"n_cols":19,"rows_kept":58,"cut":false,"hidden":false,"merged":[[26,1,26,17],[1,20,2,21],[9,19,11,19],[18,2,18,17],[5,16,5,17],[1,16,2,16],[9,2,9,16],[11,2,11,16],[12,2,12,16],[13,2,13,16],[10,2,10,15],[20,19,22,19],[19,2,19,17],[24,1,24,17],[25,2,25,17],[23,2,23,17]]}
[]
[null,null,null,null,null,null,null,null,null,null,null,null,null,null,null,null,"B"]
[]
[]
[]
[null,null,null,null,null,null,null,null,null,null,null,null,null,null,null,null,{"$f":"Start!H6","v":"2023-11-23"}]
[]
[null,"Reporting (KIP 2bis) - Bericht zu LV-Nr.",null,null,null,null,null,null,null,null,null,null,null,null,null,null,{"$f":"IF(Start!$H$8=\"(bitte auswählen)\",\"\",Start!$H$8)","v":""}]
[]
[null,"Jahr",{"$f":"IF(Start!C10=\"\",\"\",Start!C10)","v":""}]
{"$rows_left_out":49}
{"sheet":"H Hochrechnung","index":2,"n_rows":70,"n_cols":25,"rows_kept":70,"cut":false,"hidden":true,"merged":[[18,1,20,1],[18,16,18,17],[19,16,19,17],[19,18,19,19],[20,2,20,5],[20,16,20,17],[20,18,20,19],[0,5,4,17],[1,19,2,19],[5,19,5,20],[7,17,7,20],[9,2,9,20],[10,2,10,18],[10,19,10,20],[21,2,21,5],[21,16,21,17],[21,18,21,19],[22,2,22,5],[22,16,22,17],[22,18,22,19],[11,2,11,20],[12,2,12,20],[13,2,13,20],[25,2,25,5],[25,16,25,17],[25,18,25,19],[26,2,26,5],[26,16,26,17],[26,18,26,19],[23,2,23,5],[23,16,23,17],[23,18,23,19],[24,2,24,5],[24,16,24,17],[24,18,24,19],[29,2,29,5],[29,16,29,17],[29,18,29,19],[30,2,30,5],[30,16,30,17],[30,18,30,19],[27,2,27,5],[27,16,27,17],[27,18,27,19],[28,2,28,5],[28,16,28,17],[28,18,28,19],[33,2,33,5],[33,16,33,17],[33,18,33,19],[34,2,34,5],[34,16,34,17],[34,18,34,19],[31,2,31,5],[31,16,31,17],[31,18,31,19],[32,2,32,5],[32,16,32,17],[32,18,32,19],[37,2,37,5],[37,16,37,17],[37,18,37,19],[38,2,38,5],[38,16,38,17],[38,18,38,19],[35,2,35,5],[35,16,35,17],[35,18,35,19],[36,2,36,5],[36,16,36,17],[36,18,36,19],[41,2,41,5],[41,16,41,17],[41,18,41,19],[42,2,42,5],[42,16,42,17],[42,18,42,19],[39,2,39,5],[39,16,39,17],[39,18,39,19],[40,2,40,5],[40,16,40,17],[40,18,40,19],[45,2,45,5],[45,16,45,17],[45,18,45,19],[46,2,46,5],[46,16,46,17],[46,18,46,19],[43,2,43,5],[43,16,43,17],[43,18,43,19],[44,2,44,5],[44,16,44,17],[44,18,44,19],[49,2,49,5],[49,16,49,17],[49,18,49,19],[50,2,50,5],[50,16,50,17],[50,18,50,19],[47,2,47,5],[47,16,47,17],[47,18,47,19],[48,2,48,5],[48,16,48,17],[48,18,48,19],[59,7,59,14],[59,16,59,17],[59,18,59,19],[60,7,60,14],[60,16,60,17],[60,18,60,19],[52,16,52,17],[52,18,52,19],[56,16,56,17],[56,18,56,19],[58,16,58,17],[58,18,58,19],[68,2,68,20],[69,2,69,20],[63,16,63,17],[63,18,63,19],[64,16,64,17],[64,18,64,19],[66,16,66,17],[66,18,66,19],[61,7,61,14],[61,16,61,17],[61,18,61,19],[62,7,62,14],[62,16,62,17],[62,18,62,19]]}
[]
[null,null,null,null,null,null,null,null,null,null,null,null,null,null,null,null,null,null,null,"H"]
[]
[]
[]
[null,null,null,null,null,null,null,null,null,null,null,null,null,null,null,null,null,null,null,{"$f":"Start!H6","v":"2023-11-23"}]
[]
[null,"Hochrechnung (KIP 2bis) - Leistungen und Kosten zu LV-Nr.",null,null,null,null,null,null,null,null,null,null,null,null,null,null,null,{"$f":"IF(Start!H8=\"(bitte auswählen)\",\"\",Start!H8)","v":""}]
[null,null,{"$f":"R8","v":""}]
[null,"Jahr",{"$f":"IF(Start!C10=\"\",\"\",Start!C10)","v":""}]
{"$rows_left_out":61}
{"sheet":"L Leistungen und Kosten","index":3,"n_rows":70,"n_cols":28,"rows_kept":70,"cut":false,"hidden":false,"merged":[[61,7,61,15],[59,7,59,15],[69,2,69,23],[60,17,60,18],[62,17,62,18],[60,20,60,21],[62,20,62,21],[50,17,50,18],[49,20,49,21],[50,2,50,5],[50,20,50,21],[52,20,52,21],[68,2,68,23],[63,20,63,21],[64,20,64,21],[66,20,66,21],[63,17,63,18],[64,17,64,18],[61,20,61,21],[61,17,61,18],[66,17,66,18],[59,20,59,21],[58,20,58,21],[56,20,56,21],[60,7,60,15],[59,17,59,18],[37,17,37,18],[37,20,37,21],[38,17,38,18],[38,20,38,21],[44,20,44,21],[48,20,48,21],[42,20,42,21],[43,20,43,21],[45,20,45,21],[46,20,46,21],[47,20,47,21],[32,17,32,18],[28,2,28,5],[25,2,25,5],[37,2,37,5],[52,17,52,18],[58,17,58,18],[48,2,48,5],[49,2,49,5],[49,17,49,18],[44,2,44,5],[44,17,44,18],[38,2,38,5],[46,2,46,5],[46,17,46,18],[47,2,47,5],[47,17,47,18],[48,17,48,18],[42,2,42,5],[42,17,42,18],[43,2,43,5],[43,17,43,18],[45,2,45,5],[45,17,45,18],[56,17,56,18],[34,17,34,18],[35,17,35,18],[35,20,35,21],[21,20,21,21],[22,20,22,21],[22,17,22,18],[30,17,30,18],[32,2,32,5],[33,2,33,5],[29,2,29,5],[31,2,31,5],[26,2,26,5],[27,2,27,5],[28,17,28,18],[24,20,24,21],[22,2,22,5],[30,2,30,5],[23,17,23,18],[23,20,23,21],[29,20,29,21],[25,20,25,21],[26,17,26,18],[26,20,26,21],[31,20,31,21],[18,1,20,1],[19,17,19,18],[20,2,20,5],[19,20,19,21],[40,2,40,5],[40,17,40,18],[40,20,40,21],[41,2,41,5],[41,17,41,18],[41,20,41,21],[18,17,18,18],[29,17,29,18],[27,17,27,18],[27,20,27,21],[39,2,39,5],[39,17,39,18],[39,20,39,21],[21,2,21,5],[21,17,21,18],[24,2,24,5],[24,17,24,18],[23,2,23,5],[20,20,20,21],[20,17,20,18],[62,7,62,15],[0,5,4,18],[1,21,2,21],[5,21,5,23],[10,2,10,20],[7,18,7,23],[9,2,9,23],[10,21,10,23],[11,2,11,23],[12,2,12,23],[13,2,13,23],[30,20,30,21],[25,17,25,18],[28,20,28,21],[35,2,35,5],[36,2,36,5],[31,17,31,18],[32,20,32,21],[33,17,33,18],[33,20,33,21],[34,20,34,21],[36,17,36,18],[34,2,34,5],[36,20,36,21]]}
[]
[null,null,null,null,null,null,null,null,null,null,null,null,null,null,null,null,null,null,null,null,null,"L"]
[]
[]
[]
[null,null,null,null,null,null,null,null,null,null,null,null,null,null,null,null,null,null,null,null,null,{"$f":"Start!H6","v":"2023-11-23"}]
[]
[null,"Reporting (KIP 2bis) - Leistungen und Kosten zu LV-Nr.",null,null,null,null,null,null,null,null,null,null,null,null,null,null,null,null,{"$f":"IF(Start!H8=\"(bitte auswählen)\",\"\",Start!H8)","v":""}]
[null,null,{"$f":"S8","v":""}]
[null,"Jahr",{"$f":"IF(Start!C10=\"\",\"\",Start!C10)","v":""}]
{"$rows_left_out":61}
{"sheet":"C TN-Statistik Sprachkurs","index":4,"n_rows":37,"n_cols":28,"rows_kept":37,"cut":false,"hidden":true,"merged":[[9,10,10,10],[9,12,9,13],[9,16,9,20],[6,25,7,25],[33,25,36,25],[11,25,16,25],[9,1,10,1],[9,2,10,2],[9,3,10,3],[9,4,10,4],[9,6,10,6],[6,3,7,6],[6,9,7,14],[6,23,6,24],[9,8,10,8],[9,9,10,9],[9,7,10,7],[9,22,9,24],[9,11,10,11]]}
[null,null,null,null,null,null,null,null,null,null,null,null,null,null,null,null,null,null,null,null,null,null,null,null,null,null,null,{"$f":"MAX(B:B)+12","v":32}]
[null,null,null,null,null,null,null,null,null,null,null,null,null,null,null,null,null,null,null,null,null,null,null,null,"C"]
[null,null,null,null,null,null,null,null,null,null,null,null,null,null,null,null,null,null,null,null,null,null,null,null,{"$f":"Start!$H$6","v":"2023-11-23"},"hellblau = Berichterstattung"]
[null,null,null,null,null,null,null,null,null,null,null,null,null,null,null,null,null,null,null,null,null,null,null,null,null,"grün = Ankreuzen: Doppelklick"]
[null,{"$f":"\"Teilnehmerstatistik Sprachkurs zu LV-Nr.     \"&IF(Start!$H$8=\"(bitte auswählen)\",\"\",Start!$H$8)","v":"Teilnehmerstatistik Sprachkurs zu LV-Nr.     "}]
[]
[null,"Anbieter:",null,{"$f":"Start!C28&\"\"","v":""},null,null,null,null,"Kursname:",{"$f":"Start!C12&\"\"","v":""},null,null,null,null,null,"Niveau GER:",null,"-",null,"Bezeichnung:",null,null,null,null,null,"Wenn der Standort nicht eindeutig eine Gemeinde ist, dann leer lassen.\nAls Bezeichnung eine eindeutige Nummer angeben, z.B. \"N2014Q1K2\""]
[]
[]
[null,"TN","Name","Vorname","Geschlecht\n(F/M/D)","Alter","Wohnort","In der Schweiz seit\n(Jahr JJJJ)","Nationalität","Muttersprache","Aufenthaltsstatus","schulgewohnt","Kinder",null,"Bisher besuchte Deutschkurse*","Vom Kurs erfahren durch","Ergebnis",null,null,null,null,null,"eigene\n(intern)"]
{"$rows_left_out":28}
{"sheet":"C TN-Statistik Kurs allg.","index":5,"n_rows":37,"n_cols":28,"rows_kept":37,"cut":false,"hidden":true,"merged":[[6,25,7,25],[11,25,16,25],[9,1,10,1],[9,2,10,2],[9,3,10,3],[9,4,10,4],[9,6,10,6],[6,23,6,24],[6,3,7,6],[6,9,7,14],[33,25,36,25],[9,7,10,7],[9,22,9,24],[9,8,10,8],[9,9,10,9],[9,10,10,10],[9,11,10,11],[9,12,9,13],[9,16,9,20]]}
[null,null,null,null,null,null,null,null,null,null,null,null,null,null,null,null,null,null,null,null,null,null,null,null,null,null,null,{"$f":"MAX(B:B)+12","v":32}]
[null,null,null,null,null,null,null,null,null,null,null,null,null,null,null,null,null,null,null,null,null,null,null,null,"C"]
[null,null,null,null,null,null,null,null,null,null,null,null,null,null,null,null,null,null,null,null,null,null,null,null,{"$f":"Start!$H$6","v":"2023-11-23"},"hellblau = Berichterstattung"]
[null,null,null,null,null,null,null,null,null,null,null,null,null,null,null,null,null,null,null,null,null,null,null,null,null,"grün = Ankreuzen: Doppelklick"]
[null,{"$f":"\"Teilnehmerstatistik Kurs zu LV-Nr.     \"&IF(Start!$H$8=\"(bitte auswählen)\",\"\",Start!$H$8)","v":"Teilnehmerstatistik Kurs zu LV-Nr.     "}]
[]
[null,"Anbieter:",null,{"$f":"Start!C28&\"\"","v":""},null,null,null,null,"Kursname:",{"$f":"Start!C12&\"\"","v":""},null,null,null,null,null,"Niveau GER:",null,"-",null,"Bezeichnung:",null,null,null,null,null,"Wenn der Standort nicht eindeutig eine Gemeinde ist, dann leer lassen.\nAls Bezeichnung eine eindeutige Nummer angeben, z.B. \"N2014Q1K2\""]
[]
[]
[null,"TN","Name","Vorname","Geschlecht\n(F/M/D)","Alter","Wohnort","In der Schweiz seit\n(Jahr JJJJ)","Nationalität","Muttersprache","Aufenthaltsstatus","schulgewohnt","Kinder",null,"Bisher besuchte Kurse*","Vom Kurs erfahren durch","Ergebnis",null,null,null,null,null,"eigene\n(intern)"]
{"$rows_left_out":28}
{"sheet":"C TN-Statistik Erstinfo","index":6,"n_rows":117,"n_cols":28,"rows_kept":117,"cut":false,"hidden":true,"merged":[[6,3,7,6],[6,9,7,14],[6,23,6,24],[9,22,9,24],[9,7,10,7],[9,1,10,1],[9,2,10,2],[9,3,10,3],[9,4,10,4],[9,6,10,6],[1,20,2,20],[9,8,10,8],[9,26,11,26],[113,25,116,25],[9,17,9,20],[9,10,10,10],[9,11,10,11],[9,12,10,12],[9,13,10,13],[6,25,7,25],[11,25,16,25]]}
[null,null,null,null,null,null,null,null,null,null,null,null,null,null,null,null,null,null,null,null,null,null,null,null,null,null,null,{"$f":"MAX(B:B)+12","v":111}]
[null,null,null,null,null,null,null,null,null,null,null,null,null,null,null,null,null,null,null,null,null,null,null,null,"C"]
[null,null,null,null,null,null,null,null,null,null,null,null,null,null,null,null,null,null,null,null,null,null,null,null,{"$f":"Start!$H$6","v":"2023-11-23"},"hellblau = Berichterstattung"]
[null,null,null,null,null,null,null,null,null,null,null,null,null,null,null,null,null,null,null,null,null,null,null,null,null,"grün = Ankreuzen: Doppelklick"]
[null,{"$f":"\"Gesprächsstatistik Erstinformationsgespräche zu LV-Nr.     \"&IF(Start!$H$8=\"(bitte auswählen)\",\"\",Start!$H$8)","v":"Gesprächsstatistik Erstinformationsgespräche zu LV-Nr.     "}]
[]
[null,"Anbieter:",null,{"$f":"Start!C28&\"\"","v":""},null,null,null,null,"Kursname:",{"$f":"Start!C12&\"\"","v":""},null,null,null,null,null,null,null,null,null,"Bezeichnung:",null,null,null,null,null,"Wenn der Standort nicht eindeutig eine Gemeinde ist, dann leer lassen.\nAls Bezeichnung eine eindeutige Nummer angeben, z.B. \"N2014Q1K2\""]
[]
[]
[null,"TN","Name","Vorname","Geschlecht\n(F/M/D)","Alter","Wohnort","In der Schweiz seit\n(Jahr JJJJ)","Nationalität","Muttersprache","Aufenthaltsstatus","Anzahl Familien-mitglieder\ndabei","Erst-/ Folgeberatung\n(E/F)","mit Interkulturellem Übersetzer (IKÜ)","Beratungs-sprache","Vom Angebot erfahren durch","Art","Ergebnis",null,null,null,null,"eigene\n(intern)"]
{"$rows_left_out":108}
{"sheet":"C TN-Statistik Beratung","index":7,"n_rows":117,"n_cols":28,"rows_kept":117,"cut":false,"hidden":true,"merged":[[6,3,7,6],[6,9,7,14],[6,23,6,24],[9,22,9,24],[9,7,10,7],[6,25,7,25],[1,20,2,20],[9,8,10,8],[9,26,11,26],[9,10,10,10],[9,11,10,11],[9,12,10,12],[9,13,10,13],[11,25,16,25],[113,25,116,25],[9,17,9,20],[9,1,10,1],[9,2,10,2],[9,3,10,3],[9,4,10,4],[9,6,10,6]]}
[null,null,null,null,null,null,null,null,null,null,null,null,null,null,null,null,null,null,null,null,null,null,null,null,null,null,null,{"$f":"MAX(B:B)+12","v":111}]
[null,null,null,null,null,null,null,null,null,null,null,null,null,null,null,null,null,null,null,null,null,null,null,null,"C"]
[null,null,null,null,null,null,null,null,null,null,null,null,null,null,null,null,null,null,null,null,null,null,null,null,{"$f":"Start!$H$6","v":"2023-11-23"},"hellblau = Berichterstattung"]
[null,null,null,null,null,null,null,null,null,null,null,null,null,null,null,null,null,null,null,null,null,null,null,null,null,"grün = Ankreuzen: Doppelklick"]
[null,{"$f":"\"Gesprächsstatistik Beratung zu LV-Nr.     \"&IF(Start!$H$8=\"(bitte auswählen)\",\"\",Start!$H$8)","v":"Gesprächsstatistik Beratung zu LV-Nr.     "}]
[]
[null,"Anbieter:",null,{"$f":"Start!C28&\"\"","v":""},null,null,null,null,"Kursname:",{"$f":"Start!C12&\"\"","v":""},null,null,null,null,null,null,null,null,null,"Bezeichnung:",null,null,null,null,null,"Wenn der Standort nicht eindeutig eine Gemeinde ist, dann leer lassen.\nAls Bezeichnung eine eindeutige Nummer angeben, z.B. \"N2014Q1K2\""]
[]
[]
[null,"TN","Name","Vorname","Geschlecht\n(F/M/D)","Alter","Wohnort","In der Schweiz seit\n(Jahr JJJJ)","Nationalität","Muttersprache","Aufenthaltsstatus",null,"Erst-/ Folgeberatung\n(E/F)","mit Interkulturellem Übersetzer (IKÜ)","Beratungs-sprache","Vom Angebot erfahren durch","Art","Ergebnis",null,null,null,null,"eigene\n(intern)"]
{"$rows_left_out":108}
{"sheet":"AP","index":8,"n_rows":277,"n_cols":21,"rows_kept":277,"cut":false,"hidden":true,"merged":[[206,1,206,3],[206,5,206,7],[206,8,206,10],[203,1,203,3],[203,5,203,7],[203,8,203,10],[204,1,204,3],[204,5,204,7],[204,8,204,10],[205,1,205,3],[205,5,205,7],[205,8,205,10],[200,1,200,3],[200,5,200,7],[200,8,200,10],[201,1,201,3],[201,5,201,7],[201,8,201,10],[202,1,202,3],[202,5,202,7],[202,8,202,10],[196,8,196,10],[197,1,197,3],[197,5,197,7],[197,8,197,10],[198,1,198,3],[198,5,198,7],[198,8,198,10],[199,1,199,3],[199,5,199,7],[199,8,199,10],[189,1,189,3],[189,5,189,7],[189,8,189,10],[189,19,206,19],[190,1,190,3],[190,5,190,7],[190,8,190,10],[191,1,191,3],[191,5,191,7],[191,8,191,10],[192,1,192,3],[192,5,192,7],[192,8,192,10],[193,1,193,3],[193,5,193,7],[193,8,193,10],[194,1,194,3],[194,5,194,7],[194,8,194,10],[195,1,195,3],[195,5,195,7],[195,8,195,10],[196,1,196,3],[196,5,196,7],[211,1,211,3],[211,9,211,10],[212,2,212,3],[212,9,252,10],[213,2,213,3],[236,2,236,3],[237,2,237,3],[238,2,238,3],[239,2,239,3],[240,2,240,3],[214,2,214,3],[215,2,215,3],[217,2,217,3],[222,2,222,3],[223,2,223,3],[224,2,224,3],[225,2,225,3],[226,2,226,3],[235,2,235,3],[218,2,218,3],[219,2,219,3],[220,2,220,3],[221,2,221,3],[216,2,216,3],[268,20,269,20],[269,5,269,10],[264,1,264,4],[265,1,265,4],[266,1,266,4],[267,1,267,4],[268,1,269,4],[268,5,268,10],[241,2,241,3],[242,2,242,3],[261,1,261,4],[262,1,262,4],[263,1,263,4],[227,2,227,3],[228,2,228,3],[229,2,229,3],[230,2,230,3],[231,2,231,3],[232,2,232,3],[233,2,233,3],[234,2,234,3],[110,2,110,3],[111,2,111,3],[112,2,112,3],[113,2,113,3],[114,2,114,3],[115,2,115,3],[116,2,116,3],[125,2,125,3],[126,2,126,3],[117,2,117,3],[118,2,118,3],[119,2,119,3],[120,2,120,3],[121,2,121,3],[122,2,122,3],[123,2,123,3],[187,1,187,3],[187,5,187,7],[187,8,187,10],[188,1,188,3],[188,5,188,7],[188,8,188,10],[175,1,175,3],[175,5,175,7],[175,8,175,10],[180,4,180,10],[181,4,181,10],[186,1,186,3],[186,5,186,7],[186,8,186,10],[173,1,173,3],[173,5,173,7],[173,8,173,10],[174,1,174,3],[174,5,174,7],[174,8,174,10],[171,1,171,3],[171,5,171,7],[171,8,171,10],[172,1,172,3],[172,5,172,7],[172,8,172,10],[169,1,169,3],[169,5,169,7],[169,8,169,10],[170,1,170,3],[170,5,170,7],[170,8,170,10],[167,1,167,3],[167,5,167,7],[167,8,167,10],[168,1,168,3],[168,5,168,7],[168,8,168,10],[165,5,165,7],[165,8,165,10],[166,1,166,3],[166,5,166,7],[166,8,166,10],[163,1,163,3],[163,5,163,7],[163,8,163,10],[164,1,164,3],[164,5,164,7],[164,8,164,10],[158,19,175,19],[159,1,159,3],[159,5,159,7],[159,8,159,10],[160,1,160,3],[160,5,160,7],[160,8,160,10],[156,1,156,3],[156,5,156,7],[156,8,156,10],[156,19,157,19],[157,1,157,3],[157,5,157,7],[157,8,157,10],[161,1,161,3],[161,5,161,7],[161,8,161,10],[162,1,162,3],[162,5,162,7],[162,8,162,10],[158,1,158,3],[158,5,158,7],[158,8,158,10],[165,1,165,3],[132,2,132,3],[134,2,134,3],[149,4,149,10],[150,4,150,10],[155,1,155,3],[155,5,155,7],[155,8,155,10],[104,2,104,3],[104,9,144,10],[127,2,127,3],[128,2,128,3],[129,2,129,3],[130,2,130,3],[131,2,131,3],[105,2,105,3],[106,2,106,3],[107,2,107,3],[108,2,108,3],[109,2,109,3],[124,2,124,3],[133,2,133,3],[97,1,97,3],[97,4,97,5],[97,7,97,8],[97,9,97,10],[98,1,98,3],[98,4,98,5],[98,7,98,8],[98,9,98,10],[95,1,95,3],[95,4,95,5],[95,7,95,8],[95,9,95,10],[96,1,96,3],[96,4,96,5],[96,7,96,8],[96,9,96,10],[93,1,93,3],[93,4,93,5],[93,7,93,8],[93,9,93,10],[94,1,94,3],[94,4,94,5],[94,7,94,8],[94,9,94,10],[91,1,91,3],[91,4,91,5],[91,7,91,8],[91,9,91,10],[92,1,92,3],[92,4,92,5],[92,7,92,8],[92,9,92,10],[89,1,89,3],[89,4,89,5],[89,7,89,8],[89,9,89,10],[90,1,90,3],[90,4,90,5],[90,7,90,8],[90,9,90,10],[87,1,87,3],[87,4,87,5],[87,7,87,8],[87,9,87,10],[88,1,88,3],[88,4,88,5],[88,7,88,8],[88,9,88,10],[86,4,86,5],[86,7,86,8],[86,9,86,10],[83,1,83,3],[83,4,83,5],[83,7,83,8],[83,9,83,10],[84,1,84,3],[84,4,84,5],[84,7,84,8],[84,9,84,10],[79,20,134,20],[80,1,80,3],[80,4,80,5],[80,7,80,8],[80,9,80,10],[81,1,81,3],[81,4,81,5],[81,7,81,8],[81,9,81,10],[81,19,98,19],[79,1,79,3],[79,4,79,5],[79,7,79,8],[79,9,79,10],[79,19,80,19],[82,1,82,3],[82,4,82,5],[82,7,82,8],[82,9,82,10],[85,1,85,3],[85,4,85,5],[85,7,85,8],[85,9,85,10],[86,1,86,3],[69,1,69,3],[69,5,69,8],[73,4,73,10],[78,4,78,5],[78,7,78,8],[78,9,78,10],[64,5,64,8],[65,1,65,3],[65,5,65,8],[66,1,66,3],[66,5,66,8],[67,1,67,3],[67,5,67,8],[60,5,60,8],[61,1,61,3],[61,5,61,8],[62,1,62,3],[62,5,62,8],[63,1,63,3],[63,5,63,8],[64,1,64,3],[68,1,68,3],[68,5,68,8],[42,2,42,3],[43,2,43,3],[45,2,45,3],[44,2,44,3],[46,2,46,3],[27,2,27,3],[28,2,28,3],[29,2,29,3],[30,2,30,3],[31,2,31,3],[32,2,32,3],[33,2,33,3],[34,2,34,3],[35,2,35,3],[37,2,37,3],[38,2,38,3],[39,2,39,3],[103,1,103,3],[103,9,103,10],[0,9,0,10],[6,4,6,10],[4,4,4,10],[3,4,3,10],[7,5,7,10],[25,2,25,3],[26,2,26,3],[20,2,20,3],[21,2,21,3],[22,2,22,3],[23,2,23,3],[24,2,24,3],[11,4,11,10],[16,1,16,3],[17,2,17,3],[17,8,55,10],[18,2,18,3],[19,2,19,3],[36,2,36,3],[47,2,47,3],[40,2,40,3],[41,2,41,3]]}
[null,{"$f":"IF(E3=\"\",\"Abrechnungsprüfung...\",\"Abrechnungsprüfung Anbieter \"&HT!B1&\" (\"&K3&\")\")","v":"Abrechnungsprüfung..."},null,null,null,null,null,null,null,{"$f":"IF(B274=\"X\",\"Status: abgeschlossen\",\"Status: offen\")","v":"Status: offen"},null,"ausblenden",null,"ausblenden","ausblenden","ausblenden","ausblenden","ausblenden","ausblenden",null,"Anleitung:"]
[null,null,null,null,null,null,null,null,null,null,null,null,null,null,null,null,null,null,null,null,"- Farben:"]
[null,"Serie",null,null,{"$f":"IF(E6=\"\",\"\",CONCATENATE(HT!B1-2000,\"-\",MID(E6,4,1)))","v":""},null,null,null,null,null,{"$f":"IF(MID(E6,4,1)=\"3\",\"IFK\",IF(MID(E6,4,1)=\"4\",\"IP\",IF(MID(E6,4,1)=\"5\",\"RK\",\"?\")))","v":"?"},"Beitrag JI",null,null,null,null,null,null,null,null,"grau = nicht ändern"]
[null,"Anbieter",null,null,{"$f":"IF(E6=\"\",\"\",Start!C28)","v":""},null,null,null,null,null,null,"Beitrag JI2",null,null,null,null,null,null,null,null,"rosa = Hinweis, wenn Zusatzangabe fehlt"]
[null,"Angebotsname",null,null,{"$f":"IF(E6=\"\",\"\",Start!C12)","v":""},null,null,null,null,null,null,"Auszahlung",null,null,null,null,null,null,null,null,"weiss = muss ausgefüllt werden"]
[null,"LV-Nummer",null,null,{"$f":"IF(Start!H8=\"(bitte auswählen)\",\"\",Start!H8)","v":""}]
[null,"Förderbereich",null,null,{"$f":"IF(E6=\"\",\"\",LEFT(Start!C11,3))","v":""}]
[null,"Leisungsziel",null,null,{"$f":"IF(E6=\"\",\"\",Start!H11)","v":""},{"$f":"IF(E6=\"\",\"\",VLOOKUP(E8,HT!W18:Y78,3,))","v":""}]
[]
[]
{"$rows_left_out":268}
{"sheet":"HT","index":9,"n_rows":74,"n_cols":37,"rows_kept":74,"cut":false,"hidden":true,"merged":[]}
["Jahr",2023,{"$f":"TODAY()","v":"2023-11-23"},null,null,null,null,null,9]
[]
["LV-Nr.","Leistungserbringer",null,"Sachb.","FB","FB mit Text","LZ","Leistungsziele","Anbieter","Strasse","Tel","Mail","PLZ","Ort","web","Kontakt Name","Kontakt Vname","Angebotsart","TN-Statistik","TN-Zufried.h.","Serie",null,"FB","Förderbereiche",null,"Angebotsart",null,"Auftraggeber",null,"MA","Name MA","variabel/fix","vollständig","ok","Beitragskorrektur","ankreuzen","Dialogfenster am Anfang"]
["(bitte auswählen)",null,null,null,null,null,null,null,null,null,null,null,null,null,null,null,null,null,null,null,null,null,null,null,null,null,null,"(bitte auswählen)",null,null,null,"-"]
[{"$f":"LEFT(B5,10)","v":"22-3000-00"},"22-3000-00 Deutschberatung im Migrationsamt - AOZ Zürich",{"$f":"MID(B5,12,999)","v":"Deutschberatung im Migrationsamt - AOZ Zürich"},"KR",2.1,{"$f":"VLOOKUP(E5,$W$5:$X$12,2,)","v":"2.1 Sprache"},"LZ10",{"$f":"VLOOKUP(G5,$W$18:$X$78,2,)","v":"LZ10: Sprachangebote"},"AOZ","Eggbühlstrasse 15","044 415 65 00","aoz@aoz.ch",8050,"Zürich","www.aoz.ch","Rodriguez","Irene",null,null,null,{"$f":"IF(A5=\"\",\"\",CONCATENATE($B$1-2000,\"-\",MID(A5,4,1)))","v":"23-3"},null,1.1000000000000001,"1.1 Erstinformation und Integrationsförderbedarf",null,"Veranstaltung/Veranstaltungsreihe",null,null,null,"BS","Strebel Barbara","variabel","nicht relevant","ok","weniger Ausgaben als geplant (z.B. wegen geringerem Leistungsvolumen, günstigeren Konditionen etc.)","X","Migrantinnen / Migranten"]
[{"$f":"LEFT(B6,10)","v":"22-3001-00"},"22-3001-00 Sprache und Integration für Gehörlose und Hörbehinderte - DIMA Zürich",{"$f":"MID(B6,12,999)","v":"Sprache und Integration für Gehörlose und Hörbehinderte - DIMA Zürich"},"KR",2.1,{"$f":"VLOOKUP(E6,$W$5:$X$12,2,)","v":"2.1 Sprache"},"LZ10","LZ10: Sprachangebote","DIMA - Verein für Sprache und Integration","Oerlikonerstrasse 98","043 333 52 27","info@dima-glz.ch",8057,"Zürich","www.dima-glz.ch","Murk","Véronique ",null,null,null,"23-3",null,1.2,"1.2 Beratung",null,"Kurs",null,"Adlikon",null,"DS","Dominik Schmid","fix","ja","nicht ok","Kürzung der anrechenbaren Kosten (vgl. oben)",null,"vorläufig Aufgenommene / Flüchtlinge"]
["22-3002-00","22-3002-00 Schulung von Freiwilligen der HEKS Konversationskurse - HEKS Zürich","Schulung von Freiwilligen der HEKS Konversationskurse - HEKS Zürich","KR",2.1,"2.1 Sprache","LZ10","LZ10: Sprachangebote","HEKS - Regionalstelle Zürich/Schaffhausen","Seminarstrasse 28","044 360 89 60","info@heks.ch",8042,"Zürich","www.heks.ch","Chaher","Viola",null,null,null,"23-3",null,1.3,"1.3 Schutz vor Diskriminierung",null,"Angebot für Einzelpersonen (Beratung, Besuch,..)",null,"Adliswil",null,"DY","Yüksel Deniz",null,"nein"]
["22-3003-00","22-3003-00 Weiterbildung Schlüsselpersonen Frühe Sprachbildung","Weiterbildung Schlüsselpersonen Frühe Sprachbildung","FW",2.2000000000000002,"2.2 Frühe Kindheit","LZ14","LZ14: Zugang zu Angeboten Frühe Kindh.","Berufsfachschule Winterthur","Tösstalstrasse 26","052 268 14 11",null,8400,"Winterthur","www.bfs-winterthur.ch","Mirjam","Britschgi",null,null,null,"23-3",null,2.1,"2.1 Sprache",null,"Arbeitsintegrationsprogramm",null,"Aesch",null,"EK","El Khoury Ellen"]
["22-3004-00","22-3004-00 Vermittlungsstelle für interkulturelles Dolmetschen - AOZ Medios","Vermittlungsstelle für interkulturelles Dolmetschen - AOZ Medios","MG",3.1,"3.1 Interkulturelles Dolmetschen und Vermitteln","LZ18","LZ18: Angebot IKD sichern","AOZ Medios - Interkulturelles Dolmetschen","Albisriederstrasse 164 ","044 415 65 00","medios@aoz.ch",8003,"Zürich","www.aoz.ch/medios","Luthiger","Gabriela",null,null,null,"23-3",null,2.2000000000000002,"2.2 Frühe Kindheit",null,"Integrationsbegleitung",null,"Aeugst a.A.",null,"FW","Will Frank"]
["22-3005-00","22-3005-00 Medios interne Weiterbildungen - AOZ Medios","Medios interne Weiterbildungen - AOZ Medios","MG",3.1,"3.1 Interkulturelles Dolmetschen und Vermitteln","LZ19","LZ19: Qualifikat IKD fördern","AOZ Medios - Interkulturelles Dolmetschen","Albisriederstrasse 164 ","044 415 65 00","medios@aoz.ch",8003,"Zürich","www.aoz.ch/medios","Luthiger","Gabriela",null,null,null,"23-3",null,2.2999999999999998,"2.3 Arbeitsmarktfähigkeit",null,null,null,"Affoltern a.A.",null,"JK","Kramer Joy"]
{"$rows_left_out":64}