{"text_format":"1","workbook":"xlsx","n_sheets":8,"sheets":["Startseite","Dateneingabe","Anleitung Makros","Aktualisierung","Optionen","Angebote","Gemeinden","SLT-Leistungsklasse"],"not_rendered":{"charts":0,"images":7,"macros":1,"external_links":0,"defined_names":29,"comments":4,"pivot_tables":0},"unopened":[],"bounds":{"document_bytes":16777216,"sheet_cells":100000,"rows_first":2000,"rows_last":500,"rows_between":2000,"halvings":0,"cell_chars":16384,"cell_head_chars":4096},"cells_cut":0,"cells_raw":0,"read":"whole","date_system":"1900"}

{"sheet":"Startseite","index":0,"n_rows":52,"n_cols":9,"rows_kept":52,"cut":false,"hidden":false,"merged":[[3,1,3,2]]}
[]
[]
[null,"Erhebungsvorlage Integrationsagenda Kanton Zürich (IAZH)"]
[null,"Version 36 vom 9. Januar 2023",null,null,{"$f":"\"Version 2022 mit dem Arbeitsblatt «Aktualisierung» (Version \" & VALUE(SUBSTITUTE(INDEX(file_version_list,2),\"V\",\"\")) & \" vom \" & TEXT(INDEX(file_version_timestamps,2),\"t. MMMM JJJJ\") & \")\"","v":"Version 2022 mit dem Arbeitsblatt «Aktualisierung» (Version 36 vom 9. Januar 2023)"}]
[]
[]
[null,"Kontrolle des Kostendaches",null,null,{"$f":"IF(MONTH(TODAY())<4,YEAR(TODAY()-1),IF(MAX(Dateneingabe!$Q:$Q)=0,\"\",YEAR(MAX(Dateneingabe!$Q:$Q))))","v":2023}]
[null,{"$f":"IF(Auswertung_letztes_Jahr<2019,\"\",Auswertung_letztes_Jahr)","v":2023},"Auswertungsjahr",null,{"$f":"IFERROR(\">=\"&TEXT(DATE($B$8,1,1),\"T.M.JJJJ\"),\"\")","v":">=1.1.2023"},{"$f":"IFERROR(\"<=\"&TEXT(DATE($B$8,12,31),\"T.M.JJJJ\"),\"\")","v":"<=31.12.2023"}]
[null,null,{"$f":"\"Kostendach \"&IF(Auswertungsgemeinde<>\"\",Auswertungsgemeinde,\"ihrer Gemeinde\")&IF(Auswertungsjahr=\"\",\"\",\" für \"&Auswertungsjahr)&IF(B9<>\"\",\" (=100%)\",\"\")","v":"Kostendach ihrer Gemeinde für 2023"},null,{"$f":"IF(INDIRECT(\"Dateneingabe!$BA$3\",TRUE)=\"\",\"\",INDIRECT(\"Dateneingabe!$Ba$3\",TRUE))","v":""},{"$f":"IFERROR(OFFSET(INDEX(Liste_Gemeinden,MATCH(Auswertungsgemeinde,Liste_Gemeinden,0)),0,-1),\"\")","v":""},{"$f":"IF(Auswertungsgemeinde_Code&Auswertung_letztes_Jahr<>\"\",Auswertungsgemeinde_Code& \"·\" &Auswertung_letztes_Jahr,\"\")","v":"·2023"}]
[null,{"$f":"IFERROR(SUMIF(Dateneingabe!$BC:$BC,Abrechnung_Gemeinde_Jahr,Dateneingabe!$AS:$AS),\"\")","v":0},{"$f":"\"Summe der Beträge\"&IF(B8=\"\",\"\",\" für \"&B8)&\" in der Spalte «Kosten_CHF»\"&IF(B9<>\"\",\" (=\"&TEXT(B10/B9,\"0.0%\")&\")\",\"\")","v":"Summe der Beträge für 2023 in der Spalte «Kosten_CHF»"}]
[null,null,{"$f":"\"Aktuellste Summe aller anderen FFST \"&IF(Auswertungsgemeinde<>\"\",\"von \"&Auswertungsgemeinde,\"ihrer Gemeinde\") & IF(B11=\"\",\" (wenn vorhanden)\",IFERROR(\" (\"&TEXT(B11/B9,\"0.0%\")&\")\",\"\"))","v":"Aktuellste Summe aller anderen FFST ihrer Gemeinde (wenn vorhanden)"}]
[null,{"$f":"IF(ISNUMBER(B9),B9-B10-B11,\"\")","v":""},{"$f":"\"noch verfügbar \"&IF(B9<>\"\",\" (= \"&TEXT(B12/B9,\"0.0%;– 0.0%;;@\")&\")\",\"\")","v":"noch verfügbar "}]
[null,{"$f":"IFERROR(SUMIF(Dateneingabe!$BD:$BD,Abrechnung_Gemeinde_Jahr,Dateneingabe!$AS:$AS),\"\")","v":0},"Kosten Flü in der Spalte «Kosten_CHF»",null,{"$f":"IFERROR(SUMIF(Dateneingabe!$BD:$BD,Abrechnung_Gemeinde_Jahr,Dateneingabe!$AS:$AS),\"\")","v":0},{"$f":"Summe_Abrechnungsjahr_Flü","v":0}]
[null,null,"Summe der Kosten Flü aller anderen FFST ihrer Gemeinde"]
[null,{"$f":"SUM(B13:B14)","v":0},"Total der Kosten Flü in ihrer Gemeinde"]
[null,{"$f":"IFERROR(B15/(B11+B10),\"\")","v":""},"Anteil an Gesamtkosten = Max. Anteil Refinanzierung durch KSA (gem. Deklaration)",null,{"$f":"IFERROR(SUMIF(Dateneingabe!$BD:$BD,Abrechnung_Gemeinde_Jahr,Dateneingabe!$AS:$AS),\"\")","v":0},{"$f":"Summe_Abrechnungsjahr_Flü","v":0}]
[null,{"$f":"IFERROR(IF(B12<0,B12*B16*-1,\"\"),\"\")","v":""},{"$f":"IF(B9<>\"\",\"Refinanzierung durch KSA beim Überschreiten des Kostendaches (gem. Deklaration)\",\"\")","v":""}]
[]
[null,"Die Daten in dieser Excel-Datei werden einerseits für das Reporting im Rahmen der IAZH verwendet, andererseits für den Kostenersatz für Flüchtlinge im Rahmen der Sozialhilfe."]
[null,"Auf kantonaler Ebene ist für Ersteres die Fachstelle Integration (FI) zuständig, und für Letzteres das Kantonale Sozialamt (KSA)."]
[]
[null,"Diese Excel-Datei dient zur Datenübermittlung via WebTransfer ZH."]
[]
[null,"Link zur aktuellsten Version dieser Excel-Datei sowie zum Kapitel «Finanzierung und Reporting» im Online-Handbuch IAZH"]
[null,"Merkblatt «Dateiaustausch Reporting IAZH» (PDF)"]
[null,"Bei Fragen zur Integrationsagenda Zürich: integration@ji.zh.ch "]
[null,"Bei Fragen zum Kostenersatz des Kantonalen Sozialamts: oliver.haenni@sa.zh.ch"]
[]
[null,"Kommentar zu den Versionen der Erhebungsvorlage IAZH:",null,null,"Datei","Dropdown","Funktionen","Datum_Text","Datum_Zahl"]
[null,"● V036, 09.01.2023: ","Vorlagedatei ohne Jahrzahl im Dateinamen (17:15)",null,{"$f":"MID($B30,2,5)","v":" V036"},null,null,{"$f":"RIGHT(TRIM(SUBSTITUTE(SUBSTITUTE(SUBSTITUTE(B30,\":\",\"\"),\"• \",\"\"),\" \",\"\")),10)","v":"09.01.2023"},{"$f":"DATE(RIGHT($H30,4),MID($H30,4,2),LEFT($H30,2))","v":"2023-01-09"}]
[null,"● V035, 20.12.2022: ","Liste der akkreditierten Angebote aktualisiert: per 1.1.2023 gibt es 3 neue Angebote (S-01-063, S-01-064, S-03-015) und 3 gelöschte Angebote (AI-01-018, B-02-003, B-02-011)",null," V035",null,null,{"$f":"RIGHT(TRIM(SUBSTITUTE(SUBSTITUTE(SUBSTITUTE(B31,\":\",\"\"),\"• \",\"\"),\" \",\"\")),10)","v":"20.12.2022"},"2022-12-20"]
[null,"● V034, 17.11.2022: ","Arbeitsblatt «Datenerfassung» Falsche Texte in der Spalte «Angebotstitel» und im «Angebot»-Dropdown korrigiert.   ",null," V034",null,null,{"$f":"RIGHT(TRIM(SUBSTITUTE(SUBSTITUTE(SUBSTITUTE(B32,\":\",\"\"),\"• \",\"\"),\" \",\"\")),10)","v":"17.11.2022"},"2022-11-17"]
[null,"● V033, 17.11.2022: ","Spalte «Abgeschlossen» immer eingeblendet, Korrekturen im Text der Auswahlliste «Angebot» ",null," V033",null,null,{"$f":"RIGHT(TRIM(SUBSTITUTE(SUBSTITUTE(SUBSTITUTE(B33,\":\",\"\"),\"• \",\"\"),\" \",\"\")),10)","v":"17.11.2022"},"2022-11-17"]
[null,"● V032, 19.09.2022: ","Neue Angebotsliste vom 15. September 2022: 17 neue Angebote, 5 Angebote gelöscht, 58 Angebote mit Korrekturen im Text",null," V032",null,null,{"$f":"RIGHT(TRIM(SUBSTITUTE(SUBSTITUTE(SUBSTITUTE(B34,\":\",\"\"),\"• \",\"\"),\" \",\"\")),10)","v":"19.09.2022"},"2022-09-19"]
[null,"● V031, 26.07.2022: ","Daten-Import begrenzt auf 800 Zeilen / Arbeitsblatt «Datenerfassung», Spalte «Angebot»: Zeilenumbruch wird ausgeschaltet beim «Formeln zurücksetzen» ",null," V031",null,null,{"$f":"RIGHT(TRIM(SUBSTITUTE(SUBSTITUTE(SUBSTITUTE(B35,\":\",\"\"),\"• \",\"\"),\" \",\"\")),10)","v":"26.07.2022"},"2022-07-26"]
[null,"● V030, 22.07.2022: ","Behoben: «Laufzeitfehler 91» nach dem Herunterladen, Öffnen und «Bearbeitung aktivieren» (V030.007)  ",null," V030",null,null,{"$f":"RIGHT(TRIM(SUBSTITUTE(SUBSTITUTE(SUBSTITUTE(B36,\":\",\"\"),\"• \",\"\"),\" \",\"\")),10)","v":"22.07.2022"},"2022-07-22"]
[null,"● V030, 21.07.2022: ","Auswahllisten repariert, Eingebe-Hilfetexte und Validierung wieder eingebaut, Namenskonflikte behoben (V030.003)",null," V030",null,null,{"$f":"RIGHT(TRIM(SUBSTITUTE(SUBSTITUTE(SUBSTITUTE(B37,\":\",\"\"),\"• \",\"\"),\" \",\"\")),10)","v":"21.07.2022"},"2022-07-21"]
[null,"● V029, 20.07.2022: ","Neu aufgebaute Testversion mit Kostenkontrolle",null," V029",null,null,"20.07.2022","2022-07-20"]
[null,"● V028, 19.07.2022: ","Neu aufgebaute Testversion ohne Kostenkontrolle",null," V028",null,null,"19.07.2022","2022-07-19"]
[null,"● V027, 18.07.2022: ","Arbeitsblatt «Dateneingabe»: Spalte SLT-ID ganz rechts, Kostendach-Kontrolle auf der «Startseite» erweitert: KSA-Beitrag gemäss Selbsteinschätzung.",null," V027",null,null,"18.07.2022","2022-07-18"]
[null,"● V026, 15.07.2022: ","Ausgabe 2022 mit Arbeitsblatt «Aktualisierung», Dateiname «Erhebungsvorlage IAZH-2022.xlsm». Verbesserung der Bedienbarkeit, der Stabilität und der Datenqualität",null," V026",null,null,"15.07.2022","2022-07-15"]
[null,"● V025, 01.07.2022: ","Anpassungen in Formeln und in «Bedingter Formatierung» ",null," V025",null,null,"01.07.2022","2022-07-01"]
[null,"● V024, 30.06.2022: ","Arbeitsblatt «Dateneingabe»: neu werden fehlende Eingaben rot hinterlegt.",null,{"$f":"MID($B43,2,5)","v":" V024"},null,null,{"$f":"RIGHT(TRIM(SUBSTITUTE(SUBSTITUTE(SUBSTITUTE(B43,\":\",\"\"),\"• \",\"\"),\" \",\"\")),10)","v":"30.06.2022"},{"$f":"DATE(RIGHT($H43,4),MID($H43,4,2),LEFT($H43,2))","v":"2022-06-30"}]
[null,"● V023, 14.03.2022: ","neu mit Aufenthaltscode 5 «Schutzbedürftige (S)»",null," V023",null,null,"14.03.2022","2022-03-14"]
[null,"● V022, 13.12.2021: ","Angebotsliste vom 06.12.2021 integriert: 211 Angebote, darunter 41 neue und ein paar mit kleinen Textanpassungen; Formel zur Berechnung der Angebotsnummer toleranter",null," V022",null,null,"13.12.2021","2021-12-13"]
[null,"● V021, 13.12.2021: ","Neu 12 Spalten für Teilrechnungen (statt bisher 6) ",null," V021",null,null,"13.12.2021","2021-12-13"]
[null,"● V020, 06.12.2021: ","Neue Spalte «Abrechnung_Gemeinde_Jahr» ergänzt,  Formel zur Berechnung der Kosten überarbeitet, Arbeitsblatt «Aktualisierung» ergänzt.",null," V020",null,null,"06.12.2021","2021-12-06"]
[null,"● V019, 08.11.2021:","Liste der Sozialleistungsträger korrigiert (SLT-ID), neu 210 Einträge (statt 189), z.T. mit kleinem Buchstaben ergänzt",null," V019",null,null,"08.11.2021","2021-11-08"]
[null,"● V018, 21.10.2021:","Fehlende Formel in der Kostendachkontrolle ergänzt (Zelle B10).",null," V018",null,null,"21.10.2021","2021-10-21"]
[null,"● V017, 01.10.2021:","Fehlende Formeln in der Kostendachkontrolle ergänzt.",null," V017",null,null,"01.10.2021","2021-10-01"]
[null,"● V016, 30.09.2021:","SLT-ID Auswahlliste neu breiter und sortiert nach Gemeindename, Eingabehilfetexte und Kostendachberechnung überarbeitet",null," V016",null,null,"30.09.2021","2021-09-30"]
[null,"● V015, 17.09.2021:","4 neue Angebote · Codierung für Staatenlos und Unbekannt · Erklärungsvideos · Fehler Zirkelbezüge behoben",null," V015",null,null,"17.09.2021","2021-09-17"]

{"sheet":"Dateneingabe","index":1,"n_rows":51,"n_cols":59,"rows_kept":51,"cut":false,"hidden":false,"merged":[]}
["AHV-Nummer","Nachname","Vorname","Geschlecht","Geschlecht_Code","Geburtsdatum","Aufenthaltsstatus","Aufenthaltsstatus_Code","Staatsangehörigkeit","Staatsangehörigkeit_Code","Einreisedatum_in_CH","Zuzugsdatum_in_Kanton","Dossiernummer","Angebot","Angebotsnummer","Angebotstitel","Eintrittsdatum","Austrittsdatum","Angebot_CHF","TR1_Datum","TR1_Betrag","TR2_Datum","TR2_Betrag","TR3_Datum","TR3_Betrag","TR4_Datum","TR4_Betrag","TR5_Datum","TR5_Betrag","TR6_Datum","TR6_Betrag","TR7_Datum","TR7_Betrag","TR8_Datum","TR8_Betrag","TR9_Datum","TR9_Betrag","TR10_Datum","TR10_Betrag","TR11_Datum","TR11_Betrag","TR12_Datum","TR12_Betrag","Abgeschlossen","Kosten_CHF","Februar_Kosten_CHF","Rückzahlung_CHF","Diff-ID","Bemerkungen_intern","Ausblenden","dirty","SLT-ID","Politische_Gemeinde","Politische_Gemeinde_Code","Abrechnung_Gemeinde_Jahr","Abrechnung_Gemeinde_Jahr_Flü","SLT_ID","Name_Bezirk","row_id"]
[null,null,null,null,{"$f":"IFERROR(INDEX(OFFSET(Liste_Geschlecht,0,-1),MATCH($D2,Liste_Geschlecht,0)),\"\")","v":""},null,null,{"$f":"IFERROR(INDEX(OFFSET(Liste_Aufenthaltsstatus,0,-1),MATCH($G2,Liste_Aufenthaltsstatus,0)),\"\")","v":""},null,{"$f":"IFERROR(INDEX(OFFSET(Staaten,0,-1),MATCH($I2,Staaten,0)),\"\")","v":""},null,null,null,null,{"$f":"IFERROR(LEFT(N2,FIND(\" \",$N2)-1),\"\")","v":""},{"$f":"IFERROR(INDEX(Angebote!$J:$J,MATCH($O2,OFFSET(Liste_Angebote,0,1),0)+ROW(Liste_Angebote)-1),\"\")","v":""},null,null,null,null,null,null,null,null,null,null,null,null,null,null,null,null,null,null,null,null,null,null,null,null,null,null,null,null,{"$f":"IF(AND(ISBLANK($AR2),ISNUMBER($S2)),$S2,IF(SUM($U2,$W2,$Y2,$AA2,$AC2,$AE2,$AG2,$AI2,$AK2,$AM2,$AO2,$AQ2)<>0,SUM($U2,$W2,$Y2,$AA2,$AC2,$AE2,$AG2,$AI2,$AK2,$AM2,$AO2,$AQ2),$S2))","v":0},null,{"$f":"IF(ISNUMBER(AT2),AT2-AS2,0)","v":0},{"$f":"IF(AND($AU2<>0,COUNTIF($AU$2:$AU2,\"<>0\")<>OFFSET(AV2,-1,0)),COUNTIF($AU$2:$AU2,\"<>0\"),\"\")","v":""},{"$f":"IF(AND(_xlfn.ISFORMULA($AS2),ISBLANK($AR2),NOT(ISBLANK($S2))),\"Noch nicht abgerechnet; Kosten gemäss Offerte\",\"\")","v":""},{"$f":"IFERROR(IF($Q2=\"\",\"\",IF(AND(YEAR($Q2)+IF(MONTH(TODAY())<4,1,0)<YEAR(TODAY()),$AR2<>\"\"),YEAR($Q2),IF(AND(YEAR($Q2)<YEAR(TODAY()),R2<TODAY()-183),YEAR($Q2),\"\"))),\"\")","v":""},{"$f":"IFERROR(IF(_xlfn.CONCAT($A2:$AR2,TEXT($AS2,\"0;-0;;@\"),$AT2,TEXT($AU2,\"0;-0;;@\"),$AW2)=\"\",IF(AND(ROW(AY2)>2,OFFSET(AY2,1,0)<>\"\"),\"^\",\"\"),\"×\"),\"\")","v":""},{"$f":"IF($A2&$B2=\"\",\"\",OFFSET(AZ2,-1,0))","v":""},{"$f":"IFERROR(VLOOKUP($AZ2,'SLT-Leistungsklasse'!$A:$H,5,FALSE),IF($A2 & $B2 & $C2=\"\",\"\",OFFSET(BA2,-1,0)))","v":""},{"$f":"IFERROR(INDEX(OFFSET(ZH,0,-1),MATCH($BA2,ZH,0)),\"\")","v":""},{"$f":"IFERROR(IF(OR($BB2=\"\",$Q2 < _xludf.Date(2000,1,1)),\"\",$BB2 & \"·\" & YEAR($Q2)),\"\")","v":""},{"$f":"IF(OR($H2=0,$H2=3,$H2=4),$BC2,\"\")","v":""},{"$f":"IFERROR(VLOOKUP($AZ2,'SLT-Leistungsklasse'!A:B,2,FALSE),\"\")","v":""},{"$f":"IFERROR(IF(AND($BA2<>\"\",$AZ2<>\"\"),IFERROR(INDEX(OFFSET(ZH,0,-2),MATCH($BA2,ZH,0)),\"\"),\"\"),\"\")","v":""}]
[null,null,null,null,{"$f":"IFERROR(INDEX(OFFSET(Liste_Geschlecht,0,-1),MATCH($D3,Liste_Geschlecht,0)),\"\")","v":""},null,null,{"$f":"IFERROR(INDEX(OFFSET(Liste_Aufenthaltsstatus,0,-1),MATCH($G3,Liste_Aufenthaltsstatus,0)),\"\")","v":""},null,{"$f":"IFERROR(INDEX(OFFSET(Staaten,0,-1),MATCH($I3,Staaten,0)),\"\")","v":""},null,null,null,null,{"$f":"IFERROR(LEFT(N3,FIND(\" \",$N3)-1),\"\")","v":""},{"$f":"IFERROR(INDEX(Angebote!$J:$J,MATCH($O3,OFFSET(Liste_Angebote,0,1),0)+ROW(Liste_Angebote)-1),\"\")","v":""},null,null,null,null,null,null,null,null,null,null,null,null,null,null,null,null,null,null,null,null,null,null,null,null,null,null,null,null,{"$f":"IF(AND(ISBLANK($AR3),ISNUMBER($S3)),$S3,IF(SUM($U3,$W3,$Y3,$AA3,$AC3,$AE3,$AG3,$AI3,$AK3,$AM3,$AO3,$AQ3)<>0,SUM($U3,$W3,$Y3,$AA3,$AC3,$AE3,$AG3,$AI3,$AK3,$AM3,$AO3,$AQ3),$S3))","v":0},null,{"$f":"IF(ISNUMBER(AT3),AT3-AS3,0)","v":0},{"$f":"IF(AND($AU3<>0,COUNTIF($AU$2:$AU3,\"<>0\")<>OFFSET(AV3,-1,0)),COUNTIF($AU$2:$AU3,\"<>0\"),\"\")","v":""},{"$f":"IF(AND(_xlfn.ISFORMULA($AS3),ISBLANK($AR3),NOT(ISBLANK($S3))),\"Noch nicht abgerechnet; Kosten gemäss Offerte\",\"\")","v":""},{"$f":"IFERROR(IF($Q3=\"\",\"\",IF(AND(YEAR($Q3)+IF(MONTH(TODAY())<4,1,0)<YEAR(TODAY()),$AR3<>\"\"),YEAR($Q3),IF(AND(YEAR($Q3)<YEAR(TODAY()),R3<TODAY()-183),YEAR($Q3),\"\"))),\"\")","v":""},{"$f":"IFERROR(IF(_xlfn.CONCAT($A3:$AR3,TEXT($AS3,\"0;-0;;@\"),$AT3,TEXT($AU3,\"0;-0;;@\"),$AW3)=\"\",IF(AND(ROW(AY3)>2,OFFSET(AY3,1,0)<>\"\"),\"^\",\"\"),\"×\"),\"\")","v":""},{"$f":"IF($A3&$B3=\"\",\"\",OFFSET(AZ3,-1,0))","v":""},{"$f":"IFERROR(VLOOKUP($AZ3,'SLT-Leistungsklasse'!$A:$H,5,FALSE),IF($A3 & $B3 & $C3=\"\",\"\",OFFSET(BA3,-1,0)))","v":""},{"$f":"IFERROR(INDEX(OFFSET(ZH,0,-1),MATCH($BA3,ZH,0)),\"\")","v":""},{"$f":"IFERROR(IF(OR($BB3=\"\",$Q3 < DATE(2000,1,1)),\"\",$BB3 & \"·\" & YEAR($Q3)),\"\")","v":""},{"$f":"IF(OR($H3=0,$H3=3,$H3=4),$BC3,\"\")","v":""},{"$f":"IFERROR(VLOOKUP($AZ3,'SLT-Leistungsklasse'!A:B,2,FALSE),\"\")","v":""},{"$f":"IFERROR(IF(AND($BA3<>\"\",$AZ3<>\"\"),IFERROR(INDEX(OFFSET(ZH,0,-2),MATCH($BA3,ZH,0)),\"\"),\"\"),\"\")","v":""},"puvs-pfu"]
[null,null,null,null,{"$f":"IFERROR(INDEX(OFFSET(Liste_Geschlecht,0,-1),MATCH($D4,Liste_Geschlecht,0)),\"\")","v":""},null,null,{"$f":"IFERROR(INDEX(OFFSET(Liste_Aufenthaltsstatus,0,-1),MATCH($G4,Liste_Aufenthaltsstatus,0)),\"\")","v":""},null,{"$f":"IFERROR(INDEX(OFFSET(Staaten,0,-1),MATCH($I4,Staaten,0)),\"\")","v":""},null,null,null,null,{"$f":"IFERROR(LEFT(N4,FIND(\" \",$N4)-1),\"\")","v":""},{"$f":"IFERROR(INDEX(Angebote!$J:$J,MATCH($O4,OFFSET(Liste_Angebote,0,1),0)+ROW(Liste_Angebote)-1),\"\")","v":""},null,null,null,null,null,null,null,null,null,null,null,null,null,null,null,null,null,null,null,null,null,null,null,null,null,null,null,null,0,null,0,{"$f":"IF(AND($AU4<>0,COUNTIF($AU$2:$AU4,\"<>0\")<>OFFSET(AV4,-1,0)),COUNTIF($AU$2:$AU4,\"<>0\"),\"\")","v":""},{"$f":"IF(AND(_xlfn.ISFORMULA($AS4),ISBLANK($AR4),NOT(ISBLANK($S4))),\"Noch nicht abgerechnet; Kosten gemäss Offerte\",\"\")","v":""},{"$f":"IFERROR(IF($Q4=\"\",\"\",IF(AND(YEAR($Q4)+IF(MONTH(TODAY())<4,1,0)<YEAR(TODAY()),$AR4<>\"\"),YEAR($Q4),IF(AND(YEAR($Q4)<YEAR(TODAY()),R4<TODAY()-183),YEAR($Q4),\"\"))),\"\")","v":""},{"$f":"IFERROR(IF(_xlfn.CONCAT($A4:$AR4,TEXT($AS4,\"0;-0;;@\"),$AT4,TEXT($AU4,\"0;-0;;@\"),$AW4)=\"\",IF(AND(ROW(AY4)>2,OFFSET(AY4,1,0)<>\"\"),\"^\",\"\"),\"×\"),\"\")","v":""},{"$f":"IF($A4&$B4=\"\",\"\",OFFSET(AZ4,-1,0))","v":""},{"$f":"IFERROR(VLOOKUP($AZ4,'SLT-Leistungsklasse'!$A:$H,5,FALSE),IF($A4 & $B4 & $C4=\"\",\"\",OFFSET(BA4,-1,0)))","v":""},{"$f":"IFERROR(INDEX(OFFSET(ZH,0,-1),MATCH($BA4,ZH,0)),\"\")","v":""},{"$f":"IFERROR(IF(OR($BB4=\"\",$Q4 < DATE(2000,1,1)),\"\",$BB4 & \"·\" & YEAR($Q4)),\"\")","v":""},{"$f":"IF(OR($H4=0,$H4=3,$H4=4),$BC4,\"\")","v":""},{"$f":"IFERROR(VLOOKUP($AZ4,'SLT-Leistungsklasse'!A:B,2,FALSE),\"\")","v":""},{"$f":"IFERROR(IF(AND($BA4<>\"\",$AZ4<>\"\"),IFERROR(INDEX(OFFSET(ZH,0,-2),MATCH($BA4,ZH,0)),\"\"),\"\"),\"\")","v":""},"czxt-p17"]
[null,null,null,null,{"$f":"IFERROR(INDEX(OFFSET(Liste_Geschlecht,0,-1),MATCH($D5,Liste_Geschlecht,0)),\"\")","v":""},null,null,{"$f":"IFERROR(INDEX(OFFSET(Liste_Aufenthaltsstatus,0,-1),MATCH($G5,Liste_Aufenthaltsstatus,0)),\"\")","v":""},null,{"$f":"IFERROR(INDEX(OFFSET(Staaten,0,-1),MATCH($I5,Staaten,0)),\"\")","v":""},null,null,null,null,{"$f":"IFERROR(LEFT(N5,FIND(\" \",$N5)-1),\"\")","v":""},{"$f":"IFERROR(INDEX(Angebote!$J:$J,MATCH($O5,OFFSET(Liste_Angebote,0,1),0)+ROW(Liste_Angebote)-1),\"\")","v":""},null,null,null,null,null,null,null,null,null,null,null,null,null,null,null,null,null,null,null,null,null,null,null,null,null,null,null,null,0,null,0,{"$f":"IF(AND($AU5<>0,COUNTIF($AU$2:$AU5,\"<>0\")<>OFFSET(AV5,-1,0)),COUNTIF($AU$2:$AU5,\"<>0\"),\"\")","v":""},{"$f":"IF(AND(_xlfn.ISFORMULA($AS5),ISBLANK($AR5),NOT(ISBLANK($S5))),\"Noch nicht abgerechnet; Kosten gemäss Offerte\",\"\")","v":""},{"$f":"IFERROR(IF($Q5=\"\",\"\",IF(AND(YEAR($Q5)+IF(MONTH(TODAY())<4,1,0)<YEAR(TODAY()),$AR5<>\"\"),YEAR($Q5),IF(AND(YEAR($Q5)<YEAR(TODAY()),R5<TODAY()-183),YEAR($Q5),\"\"))),\"\")","v":""},{"$f":"IFERROR(IF(_xlfn.CONCAT($A5:$AR5,TEXT($AS5,\"0;-0;;@\"),$AT5,TEXT($AU5,\"0;-0;;@\"),$AW5)=\"\",IF(AND(ROW(AY5)>2,OFFSET(AY5,1,0)<>\"\"),\"^\",\"\"),\"×\"),\"\")","v":""},{"$f":"IF($A5&$B5=\"\",\"\",OFFSET(AZ5,-1,0))","v":""},{"$f":"IFERROR(VLOOKUP($AZ5,'SLT-Leistungsklasse'!$A:$H,5,FALSE),IF($A5 & $B5 & $C5=\"\",\"\",OFFSET(BA5,-1,0)))","v":""},{"$f":"IFERROR(INDEX(OFFSET(ZH,0,-1),MATCH($BA5,ZH,0)),\"\")","v":""},{"$f":"IFERROR(IF(OR($BB5=\"\",$Q5 < DATE(2000,1,1)),\"\",$BB5 & \"·\" & YEAR($Q5)),\"\")","v":""},{"$f":"IF(OR($H5=0,$H5=3,$H5=4),$BC5,\"\")","v":""},{"$f":"IFERROR(VLOOKUP($AZ5,'SLT-Leistungsklasse'!A:B,2,FALSE),\"\")","v":""},{"$f":"IFERROR(IF(AND($BA5<>\"\",$AZ5<>\"\"),IFERROR(INDEX(OFFSET(ZH,0,-2),MATCH($BA5,ZH,0)),\"\"),\"\"),\"\")","v":""},"hhje-a8z"]
[null,null,null,null,{"$f":"IFERROR(INDEX(OFFSET(Liste_Geschlecht,0,-1),MATCH($D6,Liste_Geschlecht,0)),\"\")","v":""},null,null,{"$f":"IFERROR(INDEX(OFFSET(Liste_Aufenthaltsstatus,0,-1),MATCH($G6,Liste_Aufenthaltsstatus,0)),\"\")","v":""},null,{"$f":"IFERROR(INDEX(OFFSET(Staaten,0,-1),MATCH($I6,Staaten,0)),\"\")","v":""},null,null,null,null,{"$f":"IFERROR(LEFT(N6,FIND(\" \",$N6)-1),\"\")","v":""},{"$f":"IFERROR(INDEX(Angebote!$J:$J,MATCH($O6,OFFSET(Liste_Angebote,0,1),0)+ROW(Liste_Angebote)-1),\"\")","v":""},null,null,null,null,null,null,null,null,null,null,null,null,null,null,null,null,null,null,null,null,null,null,null,null,null,null,null,null,0,null,0,{"$f":"IF(AND($AU6<>0,COUNTIF($AU$2:$AU6,\"<>0\")<>OFFSET(AV6,-1,0)),COUNTIF($AU$2:$AU6,\"<>0\"),\"\")","v":""},{"$f":"IF(AND(_xlfn.ISFORMULA($AS6),ISBLANK($AR6),NOT(ISBLANK($S6))),\"Noch nicht abgerechnet; Kosten gemäss Offerte\",\"\")","v":""},{"$f":"IFERROR(IF($Q6=\"\",\"\",IF(AND(YEAR($Q6)+IF(MONTH(TODAY())<4,1,0)<YEAR(TODAY()),$AR6<>\"\"),YEAR($Q6),IF(AND(YEAR($Q6)<YEAR(TODAY()),R6<TODAY()-183),YEAR($Q6),\"\"))),\"\")","v":""},{"$f":"IFERROR(IF(_xlfn.CONCAT($A6:$AR6,TEXT($AS6,\"0;-0;;@\"),$AT6,TEXT($AU6,\"0;-0;;@\"),$AW6)=\"\",IF(AND(ROW(AY6)>2,OFFSET(AY6,1,0)<>\"\"),\"^\",\"\"),\"×\"),\"\")","v":""},{"$f":"IF($A6&$B6=\"\",\"\",OFFSET(AZ6,-1,0))","v":""},{"$f":"IFERROR(VLOOKUP($AZ6,'SLT-Leistungsklasse'!$A:$H,5,FALSE),IF($A6 & $B6 & $C6=\"\",\"\",OFFSET(BA6,-1,0)))","v":""},{"$f":"IFERROR(INDEX(OFFSET(ZH,0,-1),MATCH($BA6,ZH,0)),\"\")","v":""},{"$f":"IFERROR(IF(OR($BB6=\"\",$Q6 < DATE(2000,1,1)),\"\",$BB6 & \"·\" & YEAR($Q6)),\"\")","v":""},{"$f":"IF(OR($H6=0,$H6=3,$H6=4),$BC6,\"\")","v":""},{"$f":"IFERROR(VLOOKUP($AZ6,'SLT-Leistungsklasse'!A:B,2,FALSE),\"\")","v":""},{"$f":"IFERROR(IF(AND($BA6<>\"\",$AZ6<>\"\"),IFERROR(INDEX(OFFSET(ZH,0,-2),MATCH($BA6,ZH,0)),\"\"),\"\"),\"\")","v":""},"a0fg-0vj"]
[null,null,null,null,{"$f":"IFERROR(INDEX(OFFSET(Liste_Geschlecht,0,-1),MATCH($D7,Liste_Geschlecht,0)),\"\")","v":""},null,null,{"$f":"IFERROR(INDEX(OFFSET(Liste_Aufenthaltsstatus,0,-1),MATCH($G7,Liste_Aufenthaltsstatus,0)),\"\")","v":""},null,{"$f":"IFERROR(INDEX(OFFSET(Staaten,0,-1),MATCH($I7,Staaten,0)),\"\")","v":""},null,null,null,null,{"$f":"IFERROR(LEFT(N7,FIND(\" \",$N7)-1),\"\")","v":""},{"$f":"IFERROR(INDEX(Angebote!$J:$J,MATCH($O7,OFFSET(Liste_Angebote,0,1),0)+ROW(Liste_Angebote)-1),\"\")","v":""},null,null,null,null,null,null,null,null,null,null,null,null,null,null,null,null,null,null,null,null,null,null,null,null,null,null,null,null,0,null,0,{"$f":"IF(AND($AU7<>0,COUNTIF($AU$2:$AU7,\"<>0\")<>OFFSET(AV7,-1,0)),COUNTIF($AU$2:$AU7,\"<>0\"),\"\")","v":""},{"$f":"IF(AND(_xlfn.ISFORMULA($AS7),ISBLANK($AR7),NOT(ISBLANK($S7))),\"Noch nicht abgerechnet; Kosten gemäss Offerte\",\"\")","v":""},{"$f":"IFERROR(IF($Q7=\"\",\"\",IF(AND(YEAR($Q7)+IF(MONTH(TODAY())<4,1,0)<YEAR(TODAY()),$AR7<>\"\"),YEAR($Q7),IF(AND(YEAR($Q7)<YEAR(TODAY()),R7<TODAY()-183),YEAR($Q7),\"\"))),\"\")","v":""},{"$f":"IFERROR(IF(_xlfn.CONCAT($A7:$AR7,TEXT($AS7,\"0;-0;;@\"),$AT7,TEXT($AU7,\"0;-0;;@\"),$AW7)=\"\",IF(AND(ROW(AY7)>2,OFFSET(AY7,1,0)<>\"\"),\"^\",\"\"),\"×\"),\"\")","v":""},{"$f":"IF($A7&$B7=\"\",\"\",OFFSET(AZ7,-1,0))","v":""},{"$f":"IFERROR(VLOOKUP($AZ7,'SLT-Leistungsklasse'!$A:$H,5,FALSE),IF($A7 & $B7 & $C7=\"\",\"\",OFFSET(BA7,-1,0)))","v":""},{"$f":"IFERROR(INDEX(OFFSET(ZH,0,-1),MATCH($BA7,ZH,0)),\"\")","v":""},{"$f":"IFERROR(IF(OR($BB7=\"\",$Q7 < DATE(2000,1,1)),\"\",$BB7 & \"·\" & YEAR($Q7)),\"\")","v":""},{"$f":"IF(OR($H7=0,$H7=3,$H7=4),$BC7,\"\")","v":""},{"$f":"IFERROR(VLOOKUP($AZ7,'SLT-Leistungsklasse'!A:B,2,FALSE),\"\")","v":""},{"$f":"IFERROR(IF(AND($BA7<>\"\",$AZ7<>\"\"),IFERROR(INDEX(OFFSET(ZH,0,-2),MATCH($BA7,ZH,0)),\"\"),\"\"),\"\")","v":""},"2lj3-9pv"]
[null,null,null,null,{"$f":"IFERROR(INDEX(OFFSET(Liste_Geschlecht,0,-1),MATCH($D8,Liste_Geschlecht,0)),\"\")","v":""},null,null,{"$f":"IFERROR(INDEX(OFFSET(Liste_Aufenthaltsstatus,0,-1),MATCH($G8,Liste_Aufenthaltsstatus,0)),\"\")","v":""},null,{"$f":"IFERROR(INDEX(OFFSET(Staaten,0,-1),MATCH($I8,Staaten,0)),\"\")","v":""},null,null,null,null,{"$f":"IFERROR(LEFT(N8,FIND(\" \",$N8)-1),\"\")","v":""},{"$f":"IFERROR(INDEX(Angebote!$J:$J,MATCH($O8,OFFSET(Liste_Angebote,0,1),0)+ROW(Liste_Angebote)-1),\"\")","v":""},null,null,null,null,null,null,null,null,null,null,null,null,null,null,null,null,null,null,null,null,null,null,null,null,null,null,null,null,0,null,0,{"$f":"IF(AND($AU8<>0,COUNTIF($AU$2:$AU8,\"<>0\")<>OFFSET(AV8,-1,0)),COUNTIF($AU$2:$AU8,\"<>0\"),\"\")","v":""},{"$f":"IF(AND(_xlfn.ISFORMULA($AS8),ISBLANK($AR8),NOT(ISBLANK($S8))),\"Noch nicht abgerechnet; Kosten gemäss Offerte\",\"\")","v":""},{"$f":"IFERROR(IF($Q8=\"\",\"\",IF(AND(YEAR($Q8)+IF(MONTH(TODAY())<4,1,0)<YEAR(TODAY()),$AR8<>\"\"),YEAR($Q8),IF(AND(YEAR($Q8)<YEAR(TODAY()),R8<TODAY()-183),YEAR($Q8),\"\"))),\"\")","v":""},{"$f":"IFERROR(IF(_xlfn.CONCAT($A8:$AR8,TEXT($AS8,\"0;-0;;@\"),$AT8,TEXT($AU8,\"0;-0;;@\"),$AW8)=\"\",IF(AND(ROW(AY8)>2,OFFSET(AY8,1,0)<>\"\"),\"^\",\"\"),\"×\"),\"\")","v":""},{"$f":"IF($A8&$B8=\"\",\"\",OFFSET(AZ8,-1,0))","v":""},{"$f":"IFERROR(VLOOKUP($AZ8,'SLT-Leistungsklasse'!$A:$H,5,FALSE),IF($A8 & $B8 & $C8=\"\",\"\",OFFSET(BA8,-1,0)))","v":""},{"$f":"IFERROR(INDEX(OFFSET(ZH,0,-1),MATCH($BA8,ZH,0)),\"\")","v":""},{"$f":"IFERROR(IF(OR($BB8=\"\",$Q8 < DATE(2000,1,1)),\"\",$BB8 & \"·\" & YEAR($Q8)),\"\")","v":""},{"$f":"IF(OR($H8=0,$H8=3,$H8=4),$BC8,\"\")","v":""},{"$f":"IFERROR(VLOOKUP($AZ8,'SLT-Leistungsklasse'!A:B,2,FALSE),\"\")","v":""},{"$f":"IFERROR(IF(AND($BA8<>\"\",$AZ8<>\"\"),IFERROR(INDEX(OFFSET(ZH,0,-2),MATCH($BA8,ZH,0)),\"\"),\"\"),\"\")","v":""},"ntsg-ax1"]
[null,null,null,null,{"$f":"IFERROR(INDEX(OFFSET(Liste_Geschlecht,0,-1),MATCH($D9,Liste_Geschlecht,0)),\"\")","v":""},null,null,{"$f":"IFERROR(INDEX(OFFSET(Liste_Aufenthaltsstatus,0,-1),MATCH($G9,Liste_Aufenthaltsstatus,0)),\"\")","v":""},null,{"$f":"IFERROR(INDEX(OFFSET(Staaten,0,-1),MATCH($I9,Staaten,0)),\"\")","v":""},null,null,null,null,{"$f":"IFERROR(LEFT(N9,FIND(\" \",$N9)-1),\"\")","v":""},{"$f":"IFERROR(INDEX(Angebote!$J:$J,MATCH($O9,OFFSET(Liste_Angebote,0,1),0)+ROW(Liste_Angebote)-1),\"\")","v":""},null,null,null,null,null,null,null,null,null,null,null,null,null,null,null,null,null,null,null,null,null,null,null,null,null,null,null,null,0,null,0,{"$f":"IF(AND($AU9<>0,COUNTIF($AU$2:$AU9,\"<>0\")<>OFFSET(AV9,-1,0)),COUNTIF($AU$2:$AU9,\"<>0\"),\"\")","v":""},{"$f":"IF(AND(_xlfn.ISFORMULA($AS9),ISBLANK($AR9),NOT(ISBLANK($S9))),\"Noch nicht abgerechnet; Kosten gemäss Offerte\",\"\")","v":""},{"$f":"IFERROR(IF($Q9=\"\",\"\",IF(AND(YEAR($Q9)+IF(MONTH(TODAY())<4,1,0)<YEAR(TODAY()),$AR9<>\"\"),YEAR($Q9),IF(AND(YEAR($Q9)<YEAR(TODAY()),R9<TODAY()-183),YEAR($Q9),\"\"))),\"\")","v":""},{"$f":"IFERROR(IF(_xlfn.CONCAT($A9:$AR9,TEXT($AS9,\"0;-0;;@\"),$AT9,TEXT($AU9,\"0;-0;;@\"),$AW9)=\"\",IF(AND(ROW(AY9)>2,OFFSET(AY9,1,0)<>\"\"),\"^\",\"\"),\"×\"),\"\")","v":""},{"$f":"IF($A9&$B9=\"\",\"\",OFFSET(AZ9,-1,0))","v":""},{"$f":"IFERROR(VLOOKUP($AZ9,'SLT-Leistungsklasse'!$A:$H,5,FALSE),IF($A9 & $B9 & $C9=\"\",\"\",OFFSET(BA9,-1,0)))","v":""},{"$f":"IFERROR(INDEX(OFFSET(ZH,0,-1),MATCH($BA9,ZH,0)),\"\")","v":""},{"$f":"IFERROR(IF(OR($BB9=\"\",$Q9 < DATE(2000,1,1)),\"\",$BB9 & \"·\" & YEAR($Q9)),\"\")","v":""},{"$f":"IF(OR($H9=0,$H9=3,$H9=4),$BC9,\"\")","v":""},{"$f":"IFERROR(VLOOKUP($AZ9,'SLT-Leistungsklasse'!A:B,2,FALSE),\"\")","v":""},{"$f":"IFERROR(IF(AND($BA9<>\"\",$AZ9<>\"\"),IFERROR(INDEX(OFFSET(ZH,0,-2),MATCH($BA9,ZH,0)),\"\"),\"\"),\"\")","v":""},"hypc-a37"]
[null,null,null,null,{"$f":"IFERROR(INDEX(OFFSET(Liste_Geschlecht,0,-1),MATCH($D10,Liste_Geschlecht,0)),\"\")","v":""},null,null,{"$f":"IFERROR(INDEX(OFFSET(Liste_Aufenthaltsstatus,0,-1),MATCH($G10,Liste_Aufenthaltsstatus,0)),\"\")","v":""},null,{"$f":"IFERROR(INDEX(OFFSET(Staaten,0,-1),MATCH($I10,Staaten,0)),\"\")","v":""},null,null,null,null,{"$f":"IFERROR(LEFT(N10,FIND(\" \",$N10)-1),\"\")","v":""},{"$f":"IFERROR(INDEX(Angebote!$J:$J,MATCH($O10,OFFSET(Liste_Angebote,0,1),0)+ROW(Liste_Angebote)-1),\"\")","v":""},null,null,null,null,null,null,null,null,null,null,null,null,null,null,null,null,null,null,null,null,null,null,null,null,null,null,null,null,0,null,0,{"$f":"IF(AND($AU10<>0,COUNTIF($AU$2:$AU10,\"<>0\")<>OFFSET(AV10,-1,0)),COUNTIF($AU$2:$AU10,\"<>0\"),\"\")","v":""},{"$f":"IF(AND(_xlfn.ISFORMULA($AS10),ISBLANK($AR10),NOT(ISBLANK($S10))),\"Noch nicht abgerechnet; Kosten gemäss Offerte\",\"\")","v":""},{"$f":"IFERROR(IF($Q10=\"\",\"\",IF(AND(YEAR($Q10)+IF(MONTH(TODAY())<4,1,0)<YEAR(TODAY()),$AR10<>\"\"),YEAR($Q10),IF(AND(YEAR($Q10)<YEAR(TODAY()),R10<TODAY()-183),YEAR($Q10),\"\"))),\"\")","v":""},{"$f":"IFERROR(IF(_xlfn.CONCAT($A10:$AR10,TEXT($AS10,\"0;-0;;@\"),$AT10,TEXT($AU10,\"0;-0;;@\"),$AW10)=\"\",IF(AND(ROW(AY10)>2,OFFSET(AY10,1,0)<>\"\"),\"^\",\"\"),\"×\"),\"\")","v":""},{"$f":"IF($A10&$B10=\"\",\"\",OFFSET(AZ10,-1,0))","v":""},{"$f":"IFERROR(VLOOKUP($AZ10,'SLT-Leistungsklasse'!$A:$H,5,FALSE),IF($A10 & $B10 & $C10=\"\",\"\",OFFSET(BA10,-1,0)))","v":""},{"$f":"IFERROR(INDEX(OFFSET(ZH,0,-1),MATCH($BA10,ZH,0)),\"\")","v":""},{"$f":"IFERROR(IF(OR($BB10=\"\",$Q10 < DATE(2000,1,1)),\"\",$BB10 & \"·\" & YEAR($Q10)),\"\")","v":""},{"$f":"IF(OR($H10=0,$H10=3,$H10=4),$BC10,\"\")","v":""},{"$f":"IFERROR(VLOOKUP($AZ10,'SLT-Leistungsklasse'!A:B,2,FALSE),\"\")","v":""},{"$f":"IFERROR(IF(AND($BA10<>\"\",$AZ10<>\"\"),IFERROR(INDEX(OFFSET(ZH,0,-2),MATCH($BA10,ZH,0)),\"\"),\"\"),\"\")","v":""},"m7xz-p62"]
[null,null,null,null,{"$f":"IFERROR(INDEX(OFFSET(Liste_Geschlecht,0,-1),MATCH($D11,Liste_Geschlecht,0)),\"\")","v":""},null,null,{"$f":"IFERROR(INDEX(OFFSET(Liste_Aufenthaltsstatus,0,-1),MATCH($G11,Liste_Aufenthaltsstatus,0)),\"\")","v":""},null,{"$f":"IFERROR(INDEX(OFFSET(Staaten,0,-1),MATCH($I11,Staaten,0)),\"\")","v":""},null,null,null,null,{"$f":"IFERROR(LEFT(N11,FIND(\" \",$N11)-1),\"\")","v":""},{"$f":"IFERROR(INDEX(Angebote!$J:$J,MATCH($O11,OFFSET(Liste_Angebote,0,1),0)+ROW(Liste_Angebote)-1),\"\")","v":""},null,null,null,null,null,null,null,null,null,null,null,null,null,null,null,null,null,null,null,null,null,null,null,null,null,null,null,null,0,null,0,{"$f":"IF(AND($AU11<>0,COUNTIF($AU$2:$AU11,\"<>0\")<>OFFSET(AV11,-1,0)),COUNTIF($AU$2:$AU11,\"<>0\"),\"\")","v":""},{"$f":"IF(AND(_xlfn.ISFORMULA($AS11),ISBLANK($AR11),NOT(ISBLANK($S11))),\"Noch nicht abgerechnet; Kosten gemäss Offerte\",\"\")","v":""},{"$f":"IFERROR(IF($Q11=\"\",\"\",IF(AND(YEAR($Q11)+IF(MONTH(TODAY())<4,1,0)<YEAR(TODAY()),$AR11<>\"\"),YEAR($Q11),IF(AND(YEAR($Q11)<YEAR(TODAY()),R11<TODAY()-183),YEAR($Q11),\"\"))),\"\")","v":""},{"$f":"IFERROR(IF(_xlfn.CONCAT($A11:$AR11,TEXT($AS11,\"0;-0;;@\"),$AT11,TEXT($AU11,\"0;-0;;@\"),$AW11)=\"\",IF(AND(ROW(AY11)>2,OFFSET(AY11,1,0)<>\"\"),\"^\",\"\"),\"×\"),\"\")","v":""},{"$f":"IF($A11&$B11=\"\",\"\",OFFSET(AZ11,-1,0))","v":""},{"$f":"IFERROR(VLOOKUP($AZ11,'SLT-Leistungsklasse'!$A:$H,5,FALSE),IF($A11 & $B11 & $C11=\"\",\"\",OFFSET(BA11,-1,0)))","v":""},{"$f":"IFERROR(INDEX(OFFSET(ZH,0,-1),MATCH($BA11,ZH,0)),\"\")","v":""},{"$f":"IFERROR(IF(OR($BB11=\"\",$Q11 < DATE(2000,1,1)),\"\",$BB11 & \"·\" & YEAR($Q11)),\"\")","v":""},{"$f":"IF(OR($H11=0,$H11=3,$H11=4),$BC11,\"\")","v":""},{"$f":"IFERROR(VLOOKUP($AZ11,'SLT-Leistungsklasse'!A:B,2,FALSE),\"\")","v":""},{"$f":"IFERROR(IF(AND($BA11<>\"\",$AZ11<>\"\"),IFERROR(INDEX(OFFSET(ZH,0,-2),MATCH($BA11,ZH,0)),\"\"),\"\"),\"\")","v":""},"vsaj-ovk"]
[null,null,null,null,{"$f":"IFERROR(INDEX(OFFSET(Liste_Geschlecht,0,-1),MATCH($D12,Liste_Geschlecht,0)),\"\")","v":""},null,null,{"$f":"IFERROR(INDEX(OFFSET(Liste_Aufenthaltsstatus,0,-1),MATCH($G12,Liste_Aufenthaltsstatus,0)),\"\")","v":""},null,{"$f":"IFERROR(INDEX(OFFSET(Staaten,0,-1),MATCH($I12,Staaten,0)),\"\")","v":""},null,null,null,null,{"$f":"IFERROR(LEFT(N12,FIND(\" \",$N12)-1),\"\")","v":""},{"$f":"IFERROR(INDEX(Angebote!$J:$J,MATCH($O12,OFFSET(Liste_Angebote,0,1),0)+ROW(Liste_Angebote)-1),\"\")","v":""},null,null,null,null,null,null,null,null,null,null,null,null,null,null,null,null,null,null,null,null,null,null,null,null,null,null,null,null,0,null,0,{"$f":"IF(AND($AU12<>0,COUNTIF($AU$2:$AU12,\"<>0\")<>OFFSET(AV12,-1,0)),COUNTIF($AU$2:$AU12,\"<>0\"),\"\")","v":""},{"$f":"IF(AND(_xlfn.ISFORMULA($AS12),ISBLANK($AR12),NOT(ISBLANK($S12))),\"Noch nicht abgerechnet; Kosten gemäss Offerte\",\"\")","v":""},{"$f":"IFERROR(IF($Q12=\"\",\"\",IF(AND(YEAR($Q12)+IF(MONTH(TODAY())<4,1,0)<YEAR(TODAY()),$AR12<>\"\"),YEAR($Q12),IF(AND(YEAR($Q12)<YEAR(TODAY()),R12<TODAY()-183),YEAR($Q12),\"\"))),\"\")","v":""},{"$f":"IFERROR(IF(_xlfn.CONCAT($A12:$AR12,TEXT($AS12,\"0;-0;;@\"),$AT12,TEXT($AU12,\"0;-0;;@\"),$AW12)=\"\",IF(AND(ROW(AY12)>2,OFFSET(AY12,1,0)<>\"\"),\"^\",\"\"),\"×\"),\"\")","v":""},{"$f":"IF($A12&$B12=\"\",\"\",OFFSET(AZ12,-1,0))","v":""},{"$f":"IFERROR(VLOOKUP($AZ12,'SLT-Leistungsklasse'!$A:$H,5,FALSE),IF($A12 & $B12 & $C12=\"\",\"\",OFFSET(BA12,-1,0)))","v":""},{"$f":"IFERROR(INDEX(OFFSET(ZH,0,-1),MATCH($BA12,ZH,0)),\"\")","v":""},{"$f":"IFERROR(IF(OR($BB12=\"\",$Q12 < DATE(2000,1,1)),\"\",$BB12 & \"·\" & YEAR($Q12)),\"\")","v":""},{"$f":"IF(OR($H12=0,$H12=3,$H12=4),$BC12,\"\")","v":""},{"$f":"IFERROR(VLOOKUP($AZ12,'SLT-Leistungsklasse'!A:B,2,FALSE),\"\")","v":""},{"$f":"IFERROR(IF(AND($BA12<>\"\",$AZ12<>\"\"),IFERROR(INDEX(OFFSET(ZH,0,-2),MATCH($BA12,ZH,0)),\"\"),\"\"),\"\")","v":""},"nmmy-evv"]
[null,null,null,null,{"$f":"IFERROR(INDEX(OFFSET(Liste_Geschlecht,0,-1),MATCH($D13,Liste_Geschlecht,0)),\"\")","v":""},null,null,{"$f":"IFERROR(INDEX(OFFSET(Liste_Aufenthaltsstatus,0,-1),MATCH($G13,Liste_Aufenthaltsstatus,0)),\"\")","v":""},null,{"$f":"IFERROR(INDEX(OFFSET(Staaten,0,-1),MATCH($I13,Staaten,0)),\"\")","v":""},null,null,null,null,{"$f":"IFERROR(LEFT(N13,FIND(\" \",$N13)-1),\"\")","v":""},{"$f":"IFERROR(INDEX(Angebote!$J:$J,MATCH($O13,OFFSET(Liste_Angebote,0,1),0)+ROW(Liste_Angebote)-1),\"\")","v":""},null,null,null,null,null,null,null,null,null,null,null,null,null,null,null,null,null,null,null,null,null,null,null,null,null,null,null,null,0,null,0,{"$f":"IF(AND($AU13<>0,COUNTIF($AU$2:$AU13,\"<>0\")<>OFFSET(AV13,-1,0)),COUNTIF($AU$2:$AU13,\"<>0\"),\"\")","v":""},{"$f":"IF(AND(_xlfn.ISFORMULA($AS13),ISBLANK($AR13),NOT(ISBLANK($S13))),\"Noch nicht abgerechnet; Kosten gemäss Offerte\",\"\")","v":""},{"$f":"IFERROR(IF($Q13=\"\",\"\",IF(AND(YEAR($Q13)+IF(MONTH(TODAY())<4,1,0)<YEAR(TODAY()),$AR13<>\"\"),YEAR($Q13),IF(AND(YEAR($Q13)<YEAR(TODAY()),R13<TODAY()-183),YEAR($Q13),\"\"))),\"\")","v":""},{"$f":"IFERROR(IF(_xlfn.CONCAT($A13:$AR13,TEXT($AS13,\"0;-0;;@\"),$AT13,TEXT($AU13,\"0;-0;;@\"),$AW13)=\"\",IF(AND(ROW(AY13)>2,OFFSET(AY13,1,0)<>\"\"),\"^\",\"\"),\"×\"),\"\")","v":""},{"$f":"IF($A13&$B13=\"\",\"\",OFFSET(AZ13,-1,0))","v":""},{"$f":"IFERROR(VLOOKUP($AZ13,'SLT-Leistungsklasse'!$A:$H,5,FALSE),IF($A13 & $B13 & $C13=\"\",\"\",OFFSET(BA13,-1,0)))","v":""},{"$f":"IFERROR(INDEX(OFFSET(ZH,0,-1),MATCH($BA13,ZH,0)),\"\")","v":""},{"$f":"IFERROR(IF(OR($BB13=\"\",$Q13 < DATE(2000,1,1)),\"\",$BB13 & \"·\" & YEAR($Q13)),\"\")","v":""},{"$f":"IF(OR($H13=0,$H13=3,$H13=4),$BC13,\"\")","v":""},{"$f":"IFERROR(VLOOKUP($AZ13,'SLT-Leistungsklasse'!A:B,2,FALSE),\"\")","v":""},{"$f":"IFERROR(IF(AND($BA13<>\"\",$AZ13<>\"\"),IFERROR(INDEX(OFFSET(ZH,0,-2),MATCH($BA13,ZH,0)),\"\"),\"\"),\"\")","v":""},"xvek-nzi"]
[null,null,null,null,{"$f":"IFERROR(INDEX(OFFSET(Liste_Geschlecht,0,-1),MATCH($D14,Liste_Geschlecht,0)),\"\")","v":""},null,null,{"$f":"IFERROR(INDEX(OFFSET(Liste_Aufenthaltsstatus,0,-1),MATCH($G14,Liste_Aufenthaltsstatus,0)),\"\")","v":""},null,{"$f":"IFERROR(INDEX(OFFSET(Staaten,0,-1),MATCH($I14,Staaten,0)),\"\")","v":""},null,null,null,null,{"$f":"IFERROR(LEFT(N14,FIND(\" \",$N14)-1),\"\")","v":""},{"$f":"IFERROR(INDEX(Angebote!$J:$J,MATCH($O14,OFFSET(Liste_Angebote,0,1),0)+ROW(Liste_Angebote)-1),\"\")","v":""},null,null,null,null,null,null,null,null,null,null,null,null,null,null,null,null,null,null,null,null,null,null,null,null,null,null,null,null,0,null,0,{"$f":"IF(AND($AU14<>0,COUNTIF($AU$2:$AU14,\"<>0\")<>OFFSET(AV14,-1,0)),COUNTIF($AU$2:$AU14,\"<>0\"),\"\")","v":""},{"$f":"IF(AND(_xlfn.ISFORMULA($AS14),ISBLANK($AR14),NOT(ISBLANK($S14))),\"Noch nicht abgerechnet; Kosten gemäss Offerte\",\"\")","v":""},{"$f":"IFERROR(IF($Q14=\"\",\"\",IF(AND(YEAR($Q14)+IF(MONTH(TODAY())<4,1,0)<YEAR(TODAY()),$AR14<>\"\"),YEAR($Q14),IF(AND(YEAR($Q14)<YEAR(TODAY()),R14<TODAY()-183),YEAR($Q14),\"\"))),\"\")","v":""},{"$f":"IFERROR(IF(_xlfn.CONCAT($A14:$AR14,TEXT($AS14,\"0;-0;;@\"),$AT14,TEXT($AU14,\"0;-0;;@\"),$AW14)=\"\",IF(AND(ROW(AY14)>2,OFFSET(AY14,1,0)<>\"\"),\"^\",\"\"),\"×\"),\"\")","v":""},{"$f":"IF($A14&$B14=\"\",\"\",OFFSET(AZ14,-1,0))","v":""},{"$f":"IFERROR(VLOOKUP($AZ14,'SLT-Leistungsklasse'!$A:$H,5,FALSE),IF($A14 & $B14 & $C14=\"\",\"\",OFFSET(BA14,-1,0)))","v":""},{"$f":"IFERROR(INDEX(OFFSET(ZH,0,-1),MATCH($BA14,ZH,0)),\"\")","v":""},{"$f":"IFERROR(IF(OR($BB14=\"\",$Q14 < DATE(2000,1,1)),\"\",$BB14 & \"·\" & YEAR($Q14)),\"\")","v":""},{"$f":"IF(OR($H14=0,$H14=3,$H14=4),$BC14,\"\")","v":""},{"$f":"IFERROR(VLOOKUP($AZ14,'SLT-Leistungsklasse'!A:B,2,FALSE),\"\")","v":""},{"$f":"IFERROR(IF(AND($BA14<>\"\",$AZ14<>\"\"),IFERROR(INDEX(OFFSET(ZH,0,-2),MATCH($BA14,ZH,0)),\"\"),\"\"),\"\")","v":""},"jc8b-m7s"]
[null,null,null,null,{"$f":"IFERROR(INDEX(OFFSET(Liste_Geschlecht,0,-1),MATCH($D15,Liste_Geschlecht,0)),\"\")","v":""},null,null,{"$f":"IFERROR(INDEX(OFFSET(Liste_Aufenthaltsstatus,0,-1),MATCH($G15,Liste_Aufenthaltsstatus,0)),\"\")","v":""},null,{"$f":"IFERROR(INDEX(OFFSET(Staaten,0,-1),MATCH($I15,Staaten,0)),\"\")","v":""},null,null,null,null,{"$f":"IFERROR(LEFT(N15,FIND(\" \",$N15)-1),\"\")","v":""},{"$f":"IFERROR(INDEX(Angebote!$J:$J,MATCH($O15,OFFSET(Liste_Angebote,0,1),0)+ROW(Liste_Angebote)-1),\"\")","v":""},null,null,null,null,null,null,null,null,null,null,null,null,null,null,null,null,null,null,null,null,null,null,null,null,null,null,null,null,0,null,0,{"$f":"IF(AND($AU15<>0,COUNTIF($AU$2:$AU15,\"<>0\")<>OFFSET(AV15,-1,0)),COUNTIF($AU$2:$AU15,\"<>0\"),\"\")","v":""},{"$f":"IF(AND(_xlfn.ISFORMULA($AS15),ISBLANK($AR15),NOT(ISBLANK($S15))),\"Noch nicht abgerechnet; Kosten gemäss Offerte\",\"\")","v":""},{"$f":"IFERROR(IF($Q15=\"\",\"\",IF(AND(YEAR($Q15)+IF(MONTH(TODAY())<4,1,0)<YEAR(TODAY()),$AR15<>\"\"),YEAR($Q15),IF(AND(YEAR($Q15)<YEAR(TODAY()),R15<TODAY()-183),YEAR($Q15),\"\"))),\"\")","v":""},{"$f":"IFERROR(IF(_xlfn.CONCAT($A15:$AR15,TEXT($AS15,\"0;-0;;@\"),$AT15,TEXT($AU15,\"0;-0;;@\"),$AW15)=\"\",IF(AND(ROW(AY15)>2,OFFSET(AY15,1,0)<>\"\"),\"^\",\"\"),\"×\"),\"\")","v":""},{"$f":"IF($A15&$B15=\"\",\"\",OFFSET(AZ15,-1,0))","v":""},{"$f":"IFERROR(VLOOKUP($AZ15,'SLT-Leistungsklasse'!$A:$H,5,FALSE),IF($A15 & $B15 & $C15=\"\",\"\",OFFSET(BA15,-1,0)))","v":""},{"$f":"IFERROR(INDEX(OFFSET(ZH,0,-1),MATCH($BA15,ZH,0)),\"\")","v":""},{"$f":"IFERROR(IF(OR($BB15=\"\",$Q15 < DATE(2000,1,1)),\"\",$BB15 & \"·\" & YEAR($Q15)),\"\")","v":""},{"$f":"IF(OR($H15=0,$H15=3,$H15=4),$BC15,\"\")","v":""},{"$f":"IFERROR(VLOOKUP($AZ15,'SLT-Leistungsklasse'!A:B,2,FALSE),\"\")","v":""},{"$f":"IFERROR(IF(AND($BA15<>\"\",$AZ15<>\"\"),IFERROR(INDEX(OFFSET(ZH,0,-2),MATCH($BA15,ZH,0)),\"\"),\"\"),\"\")","v":""},"zb7g-gg2"]
[null,null,null,null,{"$f":"IFERROR(INDEX(OFFSET(Liste_Geschlecht,0,-1),MATCH($D16,Liste_Geschlecht,0)),\"\")","v":""},null,null,{"$f":"IFERROR(INDEX(OFFSET(Liste_Aufenthaltsstatus,0,-1),MATCH($G16,Liste_Aufenthaltsstatus,0)),\"\")","v":""},null,{"$f":"IFERROR(INDEX(OFFSET(Staaten,0,-1),MATCH($I16,Staaten,0)),\"\")","v":""},null,null,null,null,{"$f":"IFERROR(LEFT(N16,FIND(\" \",$N16)-1),\"\")","v":""},{"$f":"IFERROR(INDEX(Angebote!$J:$J,MATCH($O16,OFFSET(Liste_Angebote,0,1),0)+ROW(Liste_Angebote)-1),\"\")","v":""},null,null,null,null,null,null,null,null,null,null,null,null,null,null,null,null,null,null,null,null,null,null,null,null,null,null,null,null,0,null,0,{"$f":"IF(AND($AU16<>0,COUNTIF($AU$2:$AU16,\"<>0\")<>OFFSET(AV16,-1,0)),COUNTIF($AU$2:$AU16,\"<>0\"),\"\")","v":""},{"$f":"IF(AND(_xlfn.ISFORMULA($AS16),ISBLANK($AR16),NOT(ISBLANK($S16))),\"Noch nicht abgerechnet; Kosten gemäss Offerte\",\"\")","v":""},{"$f":"IFERROR(IF($Q16=\"\",\"\",IF(AND(YEAR($Q16)+IF(MONTH(TODAY())<4,1,0)<YEAR(TODAY()),$AR16<>\"\"),YEAR($Q16),IF(AND(YEAR($Q16)<YEAR(TODAY()),R16<TODAY()-183),YEAR($Q16),\"\"))),\"\")","v":""},{"$f":"IFERROR(IF(_xlfn.CONCAT($A16:$AR16,TEXT($AS16,\"0;-0;;@\"),$AT16,TEXT($AU16,\"0;-0;;@\"),$AW16)=\"\",IF(AND(ROW(AY16)>2,OFFSET(AY16,1,0)<>\"\"),\"^\",\"\"),\"×\"),\"\")","v":""},{"$f":"IF($A16&$B16=\"\",\"\",OFFSET(AZ16,-1,0))","v":""},{"$f":"IFERROR(VLOOKUP($AZ16,'SLT-Leistungsklasse'!$A:$H,5,FALSE),IF($A16 & $B16 & $C16=\"\",\"\",OFFSET(BA16,-1,0)))","v":""},{"$f":"IFERROR(INDEX(OFFSET(ZH,0,-1),MATCH($BA16,ZH,0)),\"\")","v":""},{"$f":"IFERROR(IF(OR($BB16=\"\",$Q16 < DATE(2000,1,1)),\"\",$BB16 & \"·\" & YEAR($Q16)),\"\")","v":""},{"$f":"IF(OR($H16=0,$H16=3,$H16=4),$BC16,\"\")","v":""},{"$f":"IFERROR(VLOOKUP($AZ16,'SLT-Leistungsklasse'!A:B,2,FALSE),\"\")","v":""},{"$f":"IFERROR(IF(AND($BA16<>\"\",$AZ16<>\"\"),IFERROR(INDEX(OFFSET(ZH,0,-2),MATCH($BA16,ZH,0)),\"\"),\"\"),\"\")","v":""},"byvn-me4"]
[null,null,null,null,{"$f":"IFERROR(INDEX(OFFSET(Liste_Geschlecht,0,-1),MATCH($D17,Liste_Geschlecht,0)),\"\")","v":""},null,null,{"$f":"IFERROR(INDEX(OFFSET(Liste_Aufenthaltsstatus,0,-1),MATCH($G17,Liste_Aufenthaltsstatus,0)),\"\")","v":""},null,{"$f":"IFERROR(INDEX(OFFSET(Staaten,0,-1),MATCH($I17,Staaten,0)),\"\")","v":""},null,null,null,null,{"$f":"IFERROR(LEFT(N17,FIND(\" \",$N17)-1),\"\")","v":""},{"$f":"IFERROR(INDEX(Angebote!$J:$J,MATCH($O17,OFFSET(Liste_Angebote,0,1),0)+ROW(Liste_Angebote)-1),\"\")","v":""},null,null,null,null,null,null,null,null,null,null,null,null,null,null,null,null,null,null,null,null,null,null,null,null,null,null,null,null,0,null,0,{"$f":"IF(AND($AU17<>0,COUNTIF($AU$2:$AU17,\"<>0\")<>OFFSET(AV17,-1,0)),COUNTIF($AU$2:$AU17,\"<>0\"),\"\")","v":""},{"$f":"IF(AND(_xlfn.ISFORMULA($AS17),ISBLANK($AR17),NOT(ISBLANK($S17))),\"Noch nicht abgerechnet; Kosten gemäss Offerte\",\"\")","v":""},{"$f":"IFERROR(IF($Q17=\"\",\"\",IF(AND(YEAR($Q17)+IF(MONTH(TODAY())<4,1,0)<YEAR(TODAY()),$AR17<>\"\"),YEAR($Q17),IF(AND(YEAR($Q17)<YEAR(TODAY()),R17<TODAY()-183),YEAR($Q17),\"\"))),\"\")","v":""},{"$f":"IFERROR(IF(_xlfn.CONCAT($A17:$AR17,TEXT($AS17,\"0;-0;;@\"),$AT17,TEXT($AU17,\"0;-0;;@\"),$AW17)=\"\",IF(AND(ROW(AY17)>2,OFFSET(AY17,1,0)<>\"\"),\"^\",\"\"),\"×\"),\"\")","v":""},{"$f":"IF($A17&$B17=\"\",\"\",OFFSET(AZ17,-1,0))","v":""},{"$f":"IFERROR(VLOOKUP($AZ17,'SLT-Leistungsklasse'!$A:$H,5,FALSE),IF($A17 & $B17 & $C17=\"\",\"\",OFFSET(BA17,-1,0)))","v":""},{"$f":"IFERROR(INDEX(OFFSET(ZH,0,-1),MATCH($BA17,ZH,0)),\"\")","v":""},{"$f":"IFERROR(IF(OR($BB17=\"\",$Q17 < DATE(2000,1,1)),\"\",$BB17 & \"·\" & YEAR($Q17)),\"\")","v":""},{"$f":"IF(OR($H17=0,$H17=3,$H17=4),$BC17,\"\")","v":""},{"$f":"IFERROR(VLOOKUP($AZ17,'SLT-Leistungsklasse'!A:B,2,FALSE),\"\")","v":""},{"$f":"IFERROR(IF(AND($BA17<>\"\",$AZ17<>\"\"),IFERROR(INDEX(OFFSET(ZH,0,-2),MATCH($BA17,ZH,0)),\"\"),\"\"),\"\")","v":""},"m8hg-bij"]
[null,null,null,null,{"$f":"IFERROR(INDEX(OFFSET(Liste_Geschlecht,0,-1),MATCH($D18,Liste_Geschlecht,0)),\"\")","v":""},null,null,{"$f":"IFERROR(INDEX(OFFSET(Liste_Aufenthaltsstatus,0,-1),MATCH($G18,Liste_Aufenthaltsstatus,0)),\"\")","v":""},null,{"$f":"IFERROR(INDEX(OFFSET(Staaten,0,-1),MATCH($I18,Staaten,0)),\"\")","v":""},null,null,null,null,{"$f":"IFERROR(LEFT(N18,FIND(\" \",$N18)-1),\"\")","v":""},{"$f":"IFERROR(INDEX(Angebote!$J:$J,MATCH($O18,OFFSET(Liste_Angebote,0,1),0)+ROW(Liste_Angebote)-1),\"\")","v":""},null,null,null,null,null,null,null,null,null,null,null,null,null,null,null,null,null,null,null,null,null,null,null,null,null,null,null,null,0,null,0,{"$f":"IF(AND($AU18<>0,COUNTIF($AU$2:$AU18,\"<>0\")<>OFFSET(AV18,-1,0)),COUNTIF($AU$2:$AU18,\"<>0\"),\"\")","v":""},{"$f":"IF(AND(_xlfn.ISFORMULA($AS18),ISBLANK($AR18),NOT(ISBLANK($S18))),\"Noch nicht abgerechnet; Kosten gemäss Offerte\",\"\")","v":""},{"$f":"IFERROR(IF($Q18=\"\",\"\",IF(AND(YEAR($Q18)+IF(MONTH(TODAY())<4,1,0)<YEAR(TODAY()),$AR18<>\"\"),YEAR($Q18),IF(AND(YEAR($Q18)<YEAR(TODAY()),R18<TODAY()-183),YEAR($Q18),\"\"))),\"\")","v":""},{"$f":"IFERROR(IF(_xlfn.CONCAT($A18:$AR18,TEXT($AS18,\"0;-0;;@\"),$AT18,TEXT($AU18,\"0;-0;;@\"),$AW18)=\"\",IF(AND(ROW(AY18)>2,OFFSET(AY18,1,0)<>\"\"),\"^\",\"\"),\"×\"),\"\")","v":""},{"$f":"IF($A18&$B18=\"\",\"\",OFFSET(AZ18,-1,0))","v":""},{"$f":"IFERROR(VLOOKUP($AZ18,'SLT-Leistungsklasse'!$A:$H,5,FALSE),IF($A18 & $B18 & $C18=\"\",\"\",OFFSET(BA18,-1,0)))","v":""},{"$f":"IFERROR(INDEX(OFFSET(ZH,0,-1),MATCH($BA18,ZH,0)),\"\")","v":""},{"$f":"IFERROR(IF(OR($BB18=\"\",$Q18 < DATE(2000,1,1)),\"\",$BB18 & \"·\" & YEAR($Q18)),\"\")","v":""},{"$f":"IF(OR($H18=0,$H18=3,$H18=4),$BC18,\"\")","v":""},{"$f":"IFERROR(VLOOKUP($AZ18,'SLT-Leistungsklasse'!A:B,2,FALSE),\"\")","v":""},{"$f":"IFERROR(IF(AND($BA18<>\"\",$AZ18<>\"\"),IFERROR(INDEX(OFFSET(ZH,0,-2),MATCH($BA18,ZH,0)),\"\"),\"\"),\"\")","v":""},"9udq-hli"]
[null,null,null,null,{"$f":"IFERROR(INDEX(OFFSET(Liste_Geschlecht,0,-1),MATCH($D19,Liste_Geschlecht,0)),\"\")","v":""},null,null,{"$f":"IFERROR(INDEX(OFFSET(Liste_Aufenthaltsstatus,0,-1),MATCH($G19,Liste_Aufenthaltsstatus,0)),\"\")","v":""},null,{"$f":"IFERROR(INDEX(OFFSET(Staaten,0,-1),MATCH($I19,Staaten,0)),\"\")","v":""},null,null,null,null,{"$f":"IFERROR(LEFT(N19,FIND(\" \",$N19)-1),\"\")","v":""},{"$f":"IFERROR(INDEX(Angebote!$J:$J,MATCH($O19,OFFSET(Liste_Angebote,0,1),0)+ROW(Liste_Angebote)-1),\"\")","v":""},null,null,null,null,null,null,null,null,null,null,null,null,null,null,null,null,null,null,null,null,null,null,null,null,null,null,null,null,0,null,0,{"$f":"IF(AND($AU19<>0,COUNTIF($AU$2:$AU19,\"<>0\")<>OFFSET(AV19,-1,0)),COUNTIF($AU$2:$AU19,\"<>0\"),\"\")","v":""},{"$f":"IF(AND(_xlfn.ISFORMULA($AS19),ISBLANK($AR19),NOT(ISBLANK($S19))),\"Noch nicht abgerechnet; Kosten gemäss Offerte\",\"\")","v":""},{"$f":"IFERROR(IF($Q19=\"\",\"\",IF(AND(YEAR($Q19)+IF(MONTH(TODAY())<4,1,0)<YEAR(TODAY()),$AR19<>\"\"),YEAR($Q19),IF(AND(YEAR($Q19)<YEAR(TODAY()),R19<TODAY()-183),YEAR($Q19),\"\"))),\"\")","v":""},{"$f":"IFERROR(IF(_xlfn.CONCAT($A19:$AR19,TEXT($AS19,\"0;-0;;@\"),$AT19,TEXT($AU19,\"0;-0;;@\"),$AW19)=\"\",IF(AND(ROW(AY19)>2,OFFSET(AY19,1,0)<>\"\"),\"^\",\"\"),\"×\"),\"\")","v":""},{"$f":"IF($A19&$B19=\"\",\"\",OFFSET(AZ19,-1,0))","v":""},{"$f":"IFERROR(VLOOKUP($AZ19,'SLT-Leistungsklasse'!$A:$H,5,FALSE),IF($A19 & $B19 & $C19=\"\",\"\",OFFSET(BA19,-1,0)))","v":""},{"$f":"IFERROR(INDEX(OFFSET(ZH,0,-1),MATCH($BA19,ZH,0)),\"\")","v":""},{"$f":"IFERROR(IF(OR($BB19=\"\",$Q19 < DATE(2000,1,1)),\"\",$BB19 & \"·\" & YEAR($Q19)),\"\")","v":""},{"$f":"IF(OR($H19=0,$H19=3,$H19=4),$BC19,\"\")","v":""},{"$f":"IFERROR(VLOOKUP($AZ19,'SLT-Leistungsklasse'!A:B,2,FALSE),\"\")","v":""},{"$f":"IFERROR(IF(AND($BA19<>\"\",$AZ19<>\"\"),IFERROR(INDEX(OFFSET(ZH,0,-2),MATCH($BA19,ZH,0)),\"\"),\"\"),\"\")","v":""},"ybrr-kp5"]
[null,null,null,null,{"$f":"IFERROR(INDEX(OFFSET(Liste_Geschlecht,0,-1),MATCH($D20,Liste_Geschlecht,0)),\"\")","v":""},null,null,{"$f":"IFERROR(INDEX(OFFSET(Liste_Aufenthaltsstatus,0,-1),MATCH($G20,Liste_Aufenthaltsstatus,0)),\"\")","v":""},null,{"$f":"IFERROR(INDEX(OFFSET(Staaten,0,-1),MATCH($I20,Staaten,0)),\"\")","v":""},null,null,null,null,{"$f":"IFERROR(LEFT(N20,FIND(\" \",$N20)-1),\"\")","v":""},{"$f":"IFERROR(INDEX(Angebote!$J:$J,MATCH($O20,OFFSET(Liste_Angebote,0,1),0)+ROW(Liste_Angebote)-1),\"\")","v":""},null,null,null,null,null,null,null,null,null,null,null,null,null,null,null,null,null,null,null,null,null,null,null,null,null,null,null,null,0,null,0,{"$f":"IF(AND($AU20<>0,COUNTIF($AU$2:$AU20,\"<>0\")<>OFFSET(AV20,-1,0)),COUNTIF($AU$2:$AU20,\"<>0\"),\"\")","v":""},{"$f":"IF(AND(_xlfn.ISFORMULA($AS20),ISBLANK($AR20),NOT(ISBLANK($S20))),\"Noch nicht abgerechnet; Kosten gemäss Offerte\",\"\")","v":""},{"$f":"IFERROR(IF($Q20=\"\",\"\",IF(AND(YEAR($Q20)+IF(MONTH(TODAY())<4,1,0)<YEAR(TODAY()),$AR20<>\"\"),YEAR($Q20),IF(AND(YEAR($Q20)<YEAR(TODAY()),R20<TODAY()-183),YEAR($Q20),\"\"))),\"\")","v":""},{"$f":"IFERROR(IF(_xlfn.CONCAT($A20:$AR20,TEXT($AS20,\"0;-0;;@\"),$AT20,TEXT($AU20,\"0;-0;;@\"),$AW20)=\"\",IF(AND(ROW(AY20)>2,OFFSET(AY20,1,0)<>\"\"),\"^\",\"\"),\"×\"),\"\")","v":""},{"$f":"IF($A20&$B20=\"\",\"\",OFFSET(AZ20,-1,0))","v":""},{"$f":"IFERROR(VLOOKUP($AZ20,'SLT-Leistungsklasse'!$A:$H,5,FALSE),IF($A20 & $B20 & $C20=\"\",\"\",OFFSET(BA20,-1,0)))","v":""},{"$f":"IFERROR(INDEX(OFFSET(ZH,0,-1),MATCH($BA20,ZH,0)),\"\")","v":""},{"$f":"IFERROR(IF(OR($BB20=\"\",$Q20 < DATE(2000,1,1)),\"\",$BB20 & \"·\" & YEAR($Q20)),\"\")","v":""},{"$f":"IF(OR($H20=0,$H20=3,$H20=4),$BC20,\"\")","v":""},{"$f":"IFERROR(VLOOKUP($AZ20,'SLT-Leistungsklasse'!A:B,2,FALSE),\"\")","v":""},{"$f":"IFERROR(IF(AND($BA20<>\"\",$AZ20<>\"\"),IFERROR(INDEX(OFFSET(ZH,0,-2),MATCH($BA20,ZH,0)),\"\"),\"\"),\"\")","v":""},"o6xz-aec"]
[null,null,null,null,{"$f":"IFERROR(INDEX(OFFSET(Liste_Geschlecht,0,-1),MATCH($D21,Liste_Geschlecht,0)),\"\")","v":""},null,null,{"$f":"IFERROR(INDEX(OFFSET(Liste_Aufenthaltsstatus,0,-1),MATCH($G21,Liste_Aufenthaltsstatus,0)),\"\")","v":""},null,{"$f":"IFERROR(INDEX(OFFSET(Staaten,0,-1),MATCH($I21,Staaten,0)),\"\")","v":""},null,null,null,null,{"$f":"IFERROR(LEFT(N21,FIND(\" \",$N21)-1),\"\")","v":""},{"$f":"IFERROR(INDEX(Angebote!$J:$J,MATCH($O21,OFFSET(Liste_Angebote,0,1),0)+ROW(Liste_Angebote)-1),\"\")","v":""},null,null,null,null,null,null,null,null,null,null,null,null,null,null,null,null,null,null,null,null,null,null,null,null,null,null,null,null,0,null,0,{"$f":"IF(AND($AU21<>0,COUNTIF($AU$2:$AU21,\"<>0\")<>OFFSET(AV21,-1,0)),COUNTIF($AU$2:$AU21,\"<>0\"),\"\")","v":""},{"$f":"IF(AND(_xlfn.ISFORMULA($AS21),ISBLANK($AR21),NOT(ISBLANK($S21))),\"Noch nicht abgerechnet; Kosten gemäss Offerte\",\"\")","v":""},{"$f":"IFERROR(IF($Q21=\"\",\"\",IF(AND(YEAR($Q21)+IF(MONTH(TODAY())<4,1,0)<YEAR(TODAY()),$AR21<>\"\"),YEAR($Q21),IF(AND(YEAR($Q21)<YEAR(TODAY()),R21<TODAY()-183),YEAR($Q21),\"\"))),\"\")","v":""},{"$f":"IFERROR(IF(_xlfn.CONCAT($A21:$AR21,TEXT($AS21,\"0;-0;;@\"),$AT21,TEXT($AU21,\"0;-0;;@\"),$AW21)=\"\",IF(AND(ROW(AY21)>2,OFFSET(AY21,1,0)<>\"\"),\"^\",\"\"),\"×\"),\"\")","v":""},{"$f":"IF($A21&$B21=\"\",\"\",OFFSET(AZ21,-1,0))","v":""},{"$f":"IFERROR(VLOOKUP($AZ21,'SLT-Leistungsklasse'!$A:$H,5,FALSE),IF($A21 & $B21 & $C21=\"\",\"\",OFFSET(BA21,-1,0)))","v":""},{"$f":"IFERROR(INDEX(OFFSET(ZH,0,-1),MATCH($BA21,ZH,0)),\"\")","v":""},{"$f":"IFERROR(IF(OR($BB21=\"\",$Q21 < DATE(2000,1,1)),\"\",$BB21 & \"·\" & YEAR($Q21)),\"\")","v":""},{"$f":"IF(OR($H21=0,$H21=3,$H21=4),$BC21,\"\")","v":""},{"$f":"IFERROR(VLOOKUP($AZ21,'SLT-Leistungsklasse'!A:B,2,FALSE),\"\")","v":""},{"$f":"IFERROR(IF(AND($BA21<>\"\",$AZ21<>\"\"),IFERROR(INDEX(OFFSET(ZH,0,-2),MATCH($BA21,ZH,0)),\"\"),\"\"),\"\")","v":""},"sepp-j86"]
[null,null,null,null,{"$f":"IFERROR(INDEX(OFFSET(Liste_Geschlecht,0,-1),MATCH($D22,Liste_Geschlecht,0)),\"\")","v":""},null,null,{"$f":"IFERROR(INDEX(OFFSET(Liste_Aufenthaltsstatus,0,-1),MATCH($G22,Liste_Aufenthaltsstatus,0)),\"\")","v":""},null,{"$f":"IFERROR(INDEX(OFFSET(Staaten,0,-1),MATCH($I22,Staaten,0)),\"\")","v":""},null,null,null,null,{"$f":"IFERROR(LEFT(N22,FIND(\" \",$N22)-1),\"\")","v":""},{"$f":"IFERROR(INDEX(Angebote!$J:$J,MATCH($O22,OFFSET(Liste_Angebote,0,1),0)+ROW(Liste_Angebote)-1),\"\")","v":""},null,null,null,null,null,null,null,null,null,null,null,null,null,null,null,null,null,null,null,null,null,null,null,null,null,null,null,null,0,null,0,{"$f":"IF(AND($AU22<>0,COUNTIF($AU$2:$AU22,\"<>0\")<>OFFSET(AV22,-1,0)),COUNTIF($AU$2:$AU22,\"<>0\"),\"\")","v":""},{"$f":"IF(AND(_xlfn.ISFORMULA($AS22),ISBLANK($AR22),NOT(ISBLANK($S22))),\"Noch nicht abgerechnet; Kosten gemäss Offerte\",\"\")","v":""},{"$f":"IFERROR(IF($Q22=\"\",\"\",IF(AND(YEAR($Q22)+IF(MONTH(TODAY())<4,1,0)<YEAR(TODAY()),$AR22<>\"\"),YEAR($Q22),IF(AND(YEAR($Q22)<YEAR(TODAY()),R22<TODAY()-183),YEAR($Q22),\"\"))),\"\")","v":""},{"$f":"IFERROR(IF(_xlfn.CONCAT($A22:$AR22,TEXT($AS22,\"0;-0;;@\"),$AT22,TEXT($AU22,\"0;-0;;@\"),$AW22)=\"\",IF(AND(ROW(AY22)>2,OFFSET(AY22,1,0)<>\"\"),\"^\",\"\"),\"×\"),\"\")","v":""},{"$f":"IF($A22&$B22=\"\",\"\",OFFSET(AZ22,-1,0))","v":""},{"$f":"IFERROR(VLOOKUP($AZ22,'SLT-Leistungsklasse'!$A:$H,5,FALSE),IF($A22 & $B22 & $C22=\"\",\"\",OFFSET(BA22,-1,0)))","v":""},{"$f":"IFERROR(INDEX(OFFSET(ZH,0,-1),MATCH($BA22,ZH,0)),\"\")","v":""},{"$f":"IFERROR(IF(OR($BB22=\"\",$Q22 < DATE(2000,1,1)),\"\",$BB22 & \"·\" & YEAR($Q22)),\"\")","v":""},{"$f":"IF(OR($H22=0,$H22=3,$H22=4),$BC22,\"\")","v":""},{"$f":"IFERROR(VLOOKUP($AZ22,'SLT-Leistungsklasse'!A:B,2,FALSE),\"\")","v":""},{"$f":"IFERROR(IF(AND($BA22<>\"\",$AZ22<>\"\"),IFERROR(INDEX(OFFSET(ZH,0,-2),MATCH($BA22,ZH,0)),\"\"),\"\"),\"\")","v":""},"jps9-xl5"]
[null,null,null,null,{"$f":"IFERROR(INDEX(OFFSET(Liste_Geschlecht,0,-1),MATCH($D23,Liste_Geschlecht,0)),\"\")","v":""},null,null,{"$f":"IFERROR(INDEX(OFFSET(Liste_Aufenthaltsstatus,0,-1),MATCH($G23,Liste_Aufenthaltsstatus,0)),\"\")","v":""},null,{"$f":"IFERROR(INDEX(OFFSET(Staaten,0,-1),MATCH($I23,Staaten,0)),\"\")","v":""},null,null,null,null,{"$f":"IFERROR(LEFT(N23,FIND(\" \",$N23)-1),\"\")","v":""},{"$f":"IFERROR(INDEX(Angebote!$J:$J,MATCH($O23,OFFSET(Liste_Angebote,0,1),0)+ROW(Liste_Angebote)-1),\"\")","v":""},null,null,null,null,null,null,null,null,null,null,null,null,null,null,null,null,null,null,null,null,null,null,null,null,null,null,null,null,0,null,0,{"$f":"IF(AND($AU23<>0,COUNTIF($AU$2:$AU23,\"<>0\")<>OFFSET(AV23,-1,0)),COUNTIF($AU$2:$AU23,\"<>0\"),\"\")","v":""},{"$f":"IF(AND(_xlfn.ISFORMULA($AS23),ISBLANK($AR23),NOT(ISBLANK($S23))),\"Noch nicht abgerechnet; Kosten gemäss Offerte\",\"\")","v":""},{"$f":"IFERROR(IF($Q23=\"\",\"\",IF(AND(YEAR($Q23)+IF(MONTH(TODAY())<4,1,0)<YEAR(TODAY()),$AR23<>\"\"),YEAR($Q23),IF(AND(YEAR($Q23)<YEAR(TODAY()),R23<TODAY()-183),YEAR($Q23),\"\"))),\"\")","v":""},{"$f":"IFERROR(IF(_xlfn.CONCAT($A23:$AR23,TEXT($AS23,\"0;-0;;@\"),$AT23,TEXT($AU23,\"0;-0;;@\"),$AW23)=\"\",IF(AND(ROW(AY23)>2,OFFSET(AY23,1,0)<>\"\"),\"^\",\"\"),\"×\"),\"\")","v":""},{"$f":"IF($A23&$B23=\"\",\"\",OFFSET(AZ23,-1,0))","v":""},{"$f":"IFERROR(VLOOKUP($AZ23,'SLT-Leistungsklasse'!$A:$H,5,FALSE),IF($A23 & $B23 & $C23=\"\",\"\",OFFSET(BA23,-1,0)))","v":""},{"$f":"IFERROR(INDEX(OFFSET(ZH,0,-1),MATCH($BA23,ZH,0)),\"\")","v":""},{"$f":"IFERROR(IF(OR($BB23=\"\",$Q23 < DATE(2000,1,1)),\"\",$BB23 & \"·\" & YEAR($Q23)),\"\")","v":""},{"$f":"IF(OR($H23=0,$H23=3,$H23=4),$BC23,\"\")","v":""},{"$f":"IFERROR(VLOOKUP($AZ23,'SLT-Leistungsklasse'!A:B,2,FALSE),\"\")","v":""},{"$f":"IFERROR(IF(AND($BA23<>\"\",$AZ23<>\"\"),IFERROR(INDEX(OFFSET(ZH,0,-2),MATCH($BA23,ZH,0)),\"\"),\"\"),\"\")","v":""},"jrqp-2tq"]
[null,null,null,null,{"$f":"IFERROR(INDEX(OFFSET(Liste_Geschlecht,0,-1),MATCH($D24,Liste_Geschlecht,0)),\"\")","v":""},null,null,{"$f":"IFERROR(INDEX(OFFSET(Liste_Aufenthaltsstatus,0,-1),MATCH($G24,Liste_Aufenthaltsstatus,0)),\"\")","v":""},null,{"$f":"IFERROR(INDEX(OFFSET(Staaten,0,-1),MATCH($I24,Staaten,0)),\"\")","v":""},null,null,null,null,{"$f":"IFERROR(LEFT(N24,FIND(\" \",$N24)-1),\"\")","v":""},{"$f":"IFERROR(INDEX(Angebote!$J:$J,MATCH($O24,OFFSET(Liste_Angebote,0,1),0)+ROW(Liste_Angebote)-1),\"\")","v":""},null,null,null,null,null,null,null,null,null,null,null,null,null,null,null,null,null,null,null,null,null,null,null,null,null,null,null,null,0,null,0,{"$f":"IF(AND($AU24<>0,COUNTIF($AU$2:$AU24,\"<>0\")<>OFFSET(AV24,-1,0)),COUNTIF($AU$2:$AU24,\"<>0\"),\"\")","v":""},{"$f":"IF(AND(_xlfn.ISFORMULA($AS24),ISBLANK($AR24),NOT(ISBLANK($S24))),\"Noch nicht abgerechnet; Kosten gemäss Offerte\",\"\")","v":""},{"$f":"IFERROR(IF($Q24=\"\",\"\",IF(AND(YEAR($Q24)+IF(MONTH(TODAY())<4,1,0)<YEAR(TODAY()),$AR24<>\"\"),YEAR($Q24),IF(AND(YEAR($Q24)<YEAR(TODAY()),R24<TODAY()-183),YEAR($Q24),\"\"))),\"\")","v":""},{"$f":"IFERROR(IF(_xlfn.CONCAT($A24:$AR24,TEXT($AS24,\"0;-0;;@\"),$AT24,TEXT($AU24,\"0;-0;;@\"),$AW24)=\"\",IF(AND(ROW(AY24)>2,OFFSET(AY24,1,0)<>\"\"),\"^\",\"\"),\"×\"),\"\")","v":""},{"$f":"IF($A24&$B24=\"\",\"\",OFFSET(AZ24,-1,0))","v":""},{"$f":"IFERROR(VLOOKUP($AZ24,'SLT-Leistungsklasse'!$A:$H,5,FALSE),IF($A24 & $B24 & $C24=\"\",\"\",OFFSET(BA24,-1,0)))","v":""},{"$f":"IFERROR(INDEX(OFFSET(ZH,0,-1),MATCH($BA24,ZH,0)),\"\")","v":""},{"$f":"IFERROR(IF(OR($BB24=\"\",$Q24 < DATE(2000,1,1)),\"\",$BB24 & \"·\" & YEAR($Q24)),\"\")","v":""},{"$f":"IF(OR($H24=0,$H24=3,$H24=4),$BC24,\"\")","v":""},{"$f":"IFERROR(VLOOKUP($AZ24,'SLT-Leistungsklasse'!A:B,2,FALSE),\"\")","v":""},{"$f":"IFERROR(IF(AND($BA24<>\"\",$AZ24<>\"\"),IFERROR(INDEX(OFFSET(ZH,0,-2),MATCH($BA24,ZH,0)),\"\"),\"\"),\"\")","v":""},"12z5-c7b"]
[null,null,null,null,{"$f":"IFERROR(INDEX(OFFSET(Liste_Geschlecht,0,-1),MATCH($D25,Liste_Geschlecht,0)),\"\")","v":""},null,null,{"$f":"IFERROR(INDEX(OFFSET(Liste_Aufenthaltsstatus,0,-1),MATCH($G25,Liste_Aufenthaltsstatus,0)),\"\")","v":""},null,{"$f":"IFERROR(INDEX(OFFSET(Staaten,0,-1),MATCH($I25,Staaten,0)),\"\")","v":""},null,null,null,null,{"$f":"IFERROR(LEFT(N25,FIND(\" \",$N25)-1),\"\")","v":""},{"$f":"IFERROR(INDEX(Angebote!$J:$J,MATCH($O25,OFFSET(Liste_Angebote,0,1),0)+ROW(Liste_Angebote)-1),\"\")","v":""},null,null,null,null,null,null,null,null,null,null,null,null,null,null,null,null,null,null,null,null,null,null,null,null,null,null,null,null,0,null,0,{"$f":"IF(AND($AU25<>0,COUNTIF($AU$2:$AU25,\"<>0\")<>OFFSET(AV25,-1,0)),COUNTIF($AU$2:$AU25,\"<>0\"),\"\")","v":""},{"$f":"IF(AND(_xlfn.ISFORMULA($AS25),ISBLANK($AR25),NOT(ISBLANK($S25))),\"Noch nicht abgerechnet; Kosten gemäss Offerte\",\"\")","v":""},{"$f":"IFERROR(IF($Q25=\"\",\"\",IF(AND(YEAR($Q25)+IF(MONTH(TODAY())<4,1,0)<YEAR(TODAY()),$AR25<>\"\"),YEAR($Q25),IF(AND(YEAR($Q25)<YEAR(TODAY()),R25<TODAY()-183),YEAR($Q25),\"\"))),\"\")","v":""},{"$f":"IFERROR(IF(_xlfn.CONCAT($A25:$AR25,TEXT($AS25,\"0;-0;;@\"),$AT25,TEXT($AU25,\"0;-0;;@\"),$AW25)=\"\",IF(AND(ROW(AY25)>2,OFFSET(AY25,1,0)<>\"\"),\"^\",\"\"),\"×\"),\"\")","v":""},{"$f":"IF($A25&$B25=\"\",\"\",OFFSET(AZ25,-1,0))","v":""},{"$f":"IFERROR(VLOOKUP($AZ25,'SLT-Leistungsklasse'!$A:$H,5,FALSE),IF($A25 & $B25 & $C25=\"\",\"\",OFFSET(BA25,-1,0)))","v":""},{"$f":"IFERROR(INDEX(OFFSET(ZH,0,-1),MATCH($BA25,ZH,0)),\"\")","v":""},{"$f":"IFERROR(IF(OR($BB25=\"\",$Q25 < DATE(2000,1,1)),\"\",$BB25 & \"·\" & YEAR($Q25)),\"\")","v":""},{"$f":"IF(OR($H25=0,$H25=3,$H25=4),$BC25,\"\")","v":""},{"$f":"IFERROR(VLOOKUP($AZ25,'SLT-Leistungsklasse'!A:B,2,FALSE),\"\")","v":""},{"$f":"IFERROR(IF(AND($BA25<>\"\",$AZ25<>\"\"),IFERROR(INDEX(OFFSET(ZH,0,-2),MATCH($BA25,ZH,0)),\"\"),\"\"),\"\")","v":""},"d60t-14c"]
[null,null,null,null,{"$f":"IFERROR(INDEX(OFFSET(Liste_Geschlecht,0,-1),MATCH($D26,Liste_Geschlecht,0)),\"\")","v":""},null,null,{"$f":"IFERROR(INDEX(OFFSET(Liste_Aufenthaltsstatus,0,-1),MATCH($G26,Liste_Aufenthaltsstatus,0)),\"\")","v":""},null,{"$f":"IFERROR(INDEX(OFFSET(Staaten,0,-1),MATCH($I26,Staaten,0)),\"\")","v":""},null,null,null,null,{"$f":"IFERROR(LEFT(N26,FIND(\" \",$N26)-1),\"\")","v":""},{"$f":"IFERROR(INDEX(Angebote!$J:$J,MATCH($O26,OFFSET(Liste_Angebote,0,1),0)+ROW(Liste_Angebote)-1),\"\")","v":""},null,null,null,null,null,null,null,null,null,null,null,null,null,null,null,null,null,null,null,null,null,null,null,null,null,null,null,null,0,null,0,{"$f":"IF(AND($AU26<>0,COUNTIF($AU$2:$AU26,\"<>0\")<>OFFSET(AV26,-1,0)),COUNTIF($AU$2:$AU26,\"<>0\"),\"\")","v":""},{"$f":"IF(AND(_xlfn.ISFORMULA($AS26),ISBLANK($AR26),NOT(ISBLANK($S26))),\"Noch nicht abgerechnet; Kosten gemäss Offerte\",\"\")","v":""},{"$f":"IFERROR(IF($Q26=\"\",\"\",IF(AND(YEAR($Q26)+IF(MONTH(TODAY())<4,1,0)<YEAR(TODAY()),$AR26<>\"\"),YEAR($Q26),IF(AND(YEAR($Q26)<YEAR(TODAY()),R26<TODAY()-183),YEAR($Q26),\"\"))),\"\")","v":""},{"$f":"IFERROR(IF(_xlfn.CONCAT($A26:$AR26,TEXT($AS26,\"0;-0;;@\"),$AT26,TEXT($AU26,\"0;-0;;@\"),$AW26)=\"\",IF(AND(ROW(AY26)>2,OFFSET(AY26,1,0)<>\"\"),\"^\",\"\"),\"×\"),\"\")","v":""},{"$f":"IF($A26&$B26=\"\",\"\",OFFSET(AZ26,-1,0))","v":""},{"$f":"IFERROR(VLOOKUP($AZ26,'SLT-Leistungsklasse'!$A:$H,5,FALSE),IF($A26 & $B26 & $C26=\"\",\"\",OFFSET(BA26,-1,0)))","v":""},{"$f":"IFERROR(INDEX(OFFSET(ZH,0,-1),MATCH($BA26,ZH,0)),\"\")","v":""},{"$f":"IFERROR(IF(OR($BB26=\"\",$Q26 < DATE(2000,1,1)),\"\",$BB26 & \"·\" & YEAR($Q26)),\"\")","v":""},{"$f":"IF(OR($H26=0,$H26=3,$H26=4),$BC26,\"\")","v":""},{"$f":"IFERROR(VLOOKUP($AZ26,'SLT-Leistungsklasse'!A:B,2,FALSE),\"\")","v":""},{"$f":"IFERROR(IF(AND($BA26<>\"\",$AZ26<>\"\"),IFERROR(INDEX(OFFSET(ZH,0,-2),MATCH($BA26,ZH,0)),\"\"),\"\"),\"\")","v":""},"jff0-aea"]
[null,null,null,null,{"$f":"IFERROR(INDEX(OFFSET(Liste_Geschlecht,0,-1),MATCH($D27,Liste_Geschlecht,0)),\"\")","v":""},null,null,{"$f":"IFERROR(INDEX(OFFSET(Liste_Aufenthaltsstatus,0,-1),MATCH($G27,Liste_Aufenthaltsstatus,0)),\"\")","v":""},null,{"$f":"IFERROR(INDEX(OFFSET(Staaten,0,-1),MATCH($I27,Staaten,0)),\"\")","v":""},null,null,null,null,{"$f":"IFERROR(LEFT(N27,FIND(\" \",$N27)-1),\"\")","v":""},{"$f":"IFERROR(INDEX(Angebote!$J:$J,MATCH($O27,OFFSET(Liste_Angebote,0,1),0)+ROW(Liste_Angebote)-1),\"\")","v":""},null,null,null,null,null,null,null,null,null,null,null,null,null,null,null,null,null,null,null,null,null,null,null,null,null,null,null,null,0,null,0,{"$f":"IF(AND($AU27<>0,COUNTIF($AU$2:$AU27,\"<>0\")<>OFFSET(AV27,-1,0)),COUNTIF($AU$2:$AU27,\"<>0\"),\"\")","v":""},{"$f":"IF(AND(_xlfn.ISFORMULA($AS27),ISBLANK($AR27),NOT(ISBLANK($S27))),\"Noch nicht abgerechnet; Kosten gemäss Offerte\",\"\")","v":""},{"$f":"IFERROR(IF($Q27=\"\",\"\",IF(AND(YEAR($Q27)+IF(MONTH(TODAY())<4,1,0)<YEAR(TODAY()),$AR27<>\"\"),YEAR($Q27),IF(AND(YEAR($Q27)<YEAR(TODAY()),R27<TODAY()-183),YEAR($Q27),\"\"))),\"\")","v":""},{"$f":"IFERROR(IF(_xlfn.CONCAT($A27:$AR27,TEXT($AS27,\"0;-0;;@\"),$AT27,TEXT($AU27,\"0;-0;;@\"),$AW27)=\"\",IF(AND(ROW(AY27)>2,OFFSET(AY27,1,0)<>\"\"),\"^\",\"\"),\"×\"),\"\")","v":""},{"$f":"IF($A27&$B27=\"\",\"\",OFFSET(AZ27,-1,0))","v":""},{"$f":"IFERROR(VLOOKUP($AZ27,'SLT-Leistungsklasse'!$A:$H,5,FALSE),IF($A27 & $B27 & $C27=\"\",\"\",OFFSET(BA27,-1,0)))","v":""},{"$f":"IFERROR(INDEX(OFFSET(ZH,0,-1),MATCH($BA27,ZH,0)),\"\")","v":""},{"$f":"IFERROR(IF(OR($BB27=\"\",$Q27 < DATE(2000,1,1)),\"\",$BB27 & \"·\" & YEAR($Q27)),\"\")","v":""},{"$f":"IF(OR($H27=0,$H27=3,$H27=4),$BC27,\"\")","v":""},{"$f":"IFERROR(VLOOKUP($AZ27,'SLT-Leistungsklasse'!A:B,2,FALSE),\"\")","v":""},{"$f":"IFERROR(IF(AND($BA27<>\"\",$AZ27<>\"\"),IFERROR(INDEX(OFFSET(ZH,0,-2),MATCH($BA27,ZH,0)),\"\"),\"\"),\"\")","v":""},"bu1p-6y0"]
[null,null,null,null,{"$f":"IFERROR(INDEX(OFFSET(Liste_Geschlecht,0,-1),MATCH($D28,Liste_Geschlecht,0)),\"\")","v":""},null,null,{"$f":"IFERROR(INDEX(OFFSET(Liste_Aufenthaltsstatus,0,-1),MATCH($G28,Liste_Aufenthaltsstatus,0)),\"\")","v":""},null,{"$f":"IFERROR(INDEX(OFFSET(Staaten,0,-1),MATCH($I28,Staaten,0)),\"\")","v":""},null,null,null,null,{"$f":"IFERROR(LEFT(N28,FIND(\" \",$N28)-1),\"\")","v":""},{"$f":"IFERROR(INDEX(Angebote!$J:$J,MATCH($O28,OFFSET(Liste_Angebote,0,1),0)+ROW(Liste_Angebote)-1),\"\")","v":""},null,null,null,null,null,null,null,null,null,null,null,null,null,null,null,null,null,null,null,null,null,null,null,null,null,null,null,null,0,null,0,{"$f":"IF(AND($AU28<>0,COUNTIF($AU$2:$AU28,\"<>0\")<>OFFSET(AV28,-1,0)),COUNTIF($AU$2:$AU28,\"<>0\"),\"\")","v":""},{"$f":"IF(AND(_xlfn.ISFORMULA($AS28),ISBLANK($AR28),NOT(ISBLANK($S28))),\"Noch nicht abgerechnet; Kosten gemäss Offerte\",\"\")","v":""},{"$f":"IFERROR(IF($Q28=\"\",\"\",IF(AND(YEAR($Q28)+IF(MONTH(TODAY())<4,1,0)<YEAR(TODAY()),$AR28<>\"\"),YEAR($Q28),IF(AND(YEAR($Q28)<YEAR(TODAY()),R28<TODAY()-183),YEAR($Q28),\"\"))),\"\")","v":""},{"$f":"IFERROR(IF(_xlfn.CONCAT($A28:$AR28,TEXT($AS28,\"0;-0;;@\"),$AT28,TEXT($AU28,\"0;-0;;@\"),$AW28)=\"\",IF(AND(ROW(AY28)>2,OFFSET(AY28,1,0)<>\"\"),\"^\",\"\"),\"×\"),\"\")","v":""},{"$f":"IF($A28&$B28=\"\",\"\",OFFSET(AZ28,-1,0))","v":""},{"$f":"IFERROR(VLOOKUP($AZ28,'SLT-Leistungsklasse'!$A:$H,5,FALSE),IF($A28 & $B28 & $C28=\"\",\"\",OFFSET(BA28,-1,0)))","v":""},{"$f":"IFERROR(INDEX(OFFSET(ZH,0,-1),MATCH($BA28,ZH,0)),\"\")","v":""},{"$f":"IFERROR(IF(OR($BB28=\"\",$Q28 < DATE(2000,1,1)),\"\",$BB28 & \"·\" & YEAR($Q28)),\"\")","v":""},{"$f":"IF(OR($H28=0,$H28=3,$H28=4),$BC28,\"\")","v":""},{"$f":"IFERROR(VLOOKUP($AZ28,'SLT-Leistungsklasse'!A:B,2,FALSE),\"\")","v":""},{"$f":"IFERROR(IF(AND($BA28<>\"\",$AZ28<>\"\"),IFERROR(INDEX(OFFSET(ZH,0,-2),MATCH($BA28,ZH,0)),\"\"),\"\"),\"\")","v":""},"gyip-94t"]
[null,null,null,null,{"$f":"IFERROR(INDEX(OFFSET(Liste_Geschlecht,0,-1),MATCH($D29,Liste_Geschlecht,0)),\"\")","v":""},null,null,{"$f":"IFERROR(INDEX(OFFSET(Liste_Aufenthaltsstatus,0,-1),MATCH($G29,Liste_Aufenthaltsstatus,0)),\"\")","v":""},null,{"$f":"IFERROR(INDEX(OFFSET(Staaten,0,-1),MATCH($I29,Staaten,0)),\"\")","v":""},null,null,null,null,{"$f":"IFERROR(LEFT(N29,FIND(\" \",$N29)-1),\"\")","v":""},{"$f":"IFERROR(INDEX(Angebote!$J:$J,MATCH($O29,OFFSET(Liste_Angebote,0,1),0)+ROW(Liste_Angebote)-1),\"\")","v":""},null,null,null,null,null,null,null,null,null,null,null,null,null,null,null,null,null,null,null,null,null,null,null,null,null,null,null,null,0,null,0,{"$f":"IF(AND($AU29<>0,COUNTIF($AU$2:$AU29,\"<>0\")<>OFFSET(AV29,-1,0)),COUNTIF($AU$2:$AU29,\"<>0\"),\"\")","v":""},{"$f":"IF(AND(_xlfn.ISFORMULA($AS29),ISBLANK($AR29),NOT(ISBLANK($S29))),\"Noch nicht abgerechnet; Kosten gemäss Offerte\",\"\")","v":""},{"$f":"IFERROR(IF($Q29=\"\",\"\",IF(AND(YEAR($Q29)+IF(MONTH(TODAY())<4,1,0)<YEAR(TODAY()),$AR29<>\"\"),YEAR($Q29),IF(AND(YEAR($Q29)<YEAR(TODAY()),R29<TODAY()-183),YEAR($Q29),\"\"))),\"\")","v":""},{"$f":"IFERROR(IF(_xlfn.CONCAT($A29:$AR29,TEXT($AS29,\"0;-0;;@\"),$AT29,TEXT($AU29,\"0;-0;;@\"),$AW29)=\"\",IF(AND(ROW(AY29)>2,OFFSET(AY29,1,0)<>\"\"),\"^\",\"\"),\"×\"),\"\")","v":""},{"$f":"IF($A29&$B29=\"\",\"\",OFFSET(AZ29,-1,0))","v":""},{"$f":"IFERROR(VLOOKUP($AZ29,'SLT-Leistungsklasse'!$A:$H,5,FALSE),IF($A29 & $B29 & $C29=\"\",\"\",OFFSET(BA29,-1,0)))","v":""},{"$f":"IFERROR(INDEX(OFFSET(ZH,0,-1),MATCH($BA29,ZH,0)),\"\")","v":""},{"$f":"IFERROR(IF(OR($BB29=\"\",$Q29 < DATE(2000,1,1)),\"\",$BB29 & \"·\" & YEAR($Q29)),\"\")","v":""},{"$f":"IF(OR($H29=0,$H29=3,$H29=4),$BC29,\"\")","v":""},{"$f":"IFERROR(VLOOKUP($AZ29,'SLT-Leistungsklasse'!A:B,2,FALSE),\"\")","v":""},{"$f":"IFERROR(IF(AND($BA29<>\"\",$AZ29<>\"\"),IFERROR(INDEX(OFFSET(ZH,0,-2),MATCH($BA29,ZH,0)),\"\"),\"\"),\"\")","v":""},"b61b-sgj"]
[null,null,null,null,{"$f":"IFERROR(INDEX(OFFSET(Liste_Geschlecht,0,-1),MATCH($D30,Liste_Geschlecht,0)),\"\")","v":""},null,null,{"$f":"IFERROR(INDEX(OFFSET(Liste_Aufenthaltsstatus,0,-1),MATCH($G30,Liste_Aufenthaltsstatus,0)),\"\")","v":""},null,{"$f":"IFERROR(INDEX(OFFSET(Staaten,0,-1),MATCH($I30,Staaten,0)),\"\")","v":""},null,null,null,null,{"$f":"IFERROR(LEFT(N30,FIND(\" \",$N30)-1),\"\")","v":""},{"$f":"IFERROR(INDEX(Angebote!$J:$J,MATCH($O30,OFFSET(Liste_Angebote,0,1),0)+ROW(Liste_Angebote)-1),\"\")","v":""},null,null,null,null,null,null,null,null,null,null,null,null,null,null,null,null,null,null,null,null,null,null,null,null,null,null,null,null,0,null,0,{"$f":"IF(AND($AU30<>0,COUNTIF($AU$2:$AU30,\"<>0\")<>OFFSET(AV30,-1,0)),COUNTIF($AU$2:$AU30,\"<>0\"),\"\")","v":""},{"$f":"IF(AND(_xlfn.ISFORMULA($AS30),ISBLANK($AR30),NOT(ISBLANK($S30))),\"Noch nicht abgerechnet; Kosten gemäss Offerte\",\"\")","v":""},{"$f":"IFERROR(IF($Q30=\"\",\"\",IF(AND(YEAR($Q30)+IF(MONTH(TODAY())<4,1,0)<YEAR(TODAY()),$AR30<>\"\"),YEAR($Q30),IF(AND(YEAR($Q30)<YEAR(TODAY()),R30<TODAY()-183),YEAR($Q30),\"\"))),\"\")","v":""},{"$f":"IFERROR(IF(_xlfn.CONCAT($A30:$AR30,TEXT($AS30,\"0;-0;;@\"),$AT30,TEXT($AU30,\"0;-0;;@\"),$AW30)=\"\",IF(AND(ROW(AY30)>2,OFFSET(AY30,1,0)<>\"\"),\"^\",\"\"),\"×\"),\"\")","v":""},{"$f":"IF($A30&$B30=\"\",\"\",OFFSET(AZ30,-1,0))","v":""},{"$f":"IFERROR(VLOOKUP($AZ30,'SLT-Leistungsklasse'!$A:$H,5,FALSE),IF($A30 & $B30 & $C30=\"\",\"\",OFFSET(BA30,-1,0)))","v":""},{"$f":"IFERROR(INDEX(OFFSET(ZH,0,-1),MATCH($BA30,ZH,0)),\"\")","v":""},{"$f":"IFERROR(IF(OR($BB30=\"\",$Q30 < DATE(2000,1,1)),\"\",$BB30 & \"·\" & YEAR($Q30)),\"\")","v":""},{"$f":"IF(OR($H30=0,$H30=3,$H30=4),$BC30,\"\")","v":""},{"$f":"IFERROR(VLOOKUP($AZ30,'SLT-Leistungsklasse'!A:B,2,FALSE),\"\")","v":""},{"$f":"IFERROR(IF(AND($BA30<>\"\",$AZ30<>\"\"),IFERROR(INDEX(OFFSET(ZH,0,-2),MATCH($BA30,ZH,0)),\"\"),\"\"),\"\")","v":""},"pe3u-rf1"]
[null,null,null,null,{"$f":"IFERROR(INDEX(OFFSET(Liste_Geschlecht,0,-1),MATCH($D31,Liste_Geschlecht,0)),\"\")","v":""},null,null,{"$f":"IFERROR(INDEX(OFFSET(Liste_Aufenthaltsstatus,0,-1),MATCH($G31,Liste_Aufenthaltsstatus,0)),\"\")","v":""},null,{"$f":"IFERROR(INDEX(OFFSET(Staaten,0,-1),MATCH($I31,Staaten,0)),\"\")","v":""},null,null,null,null,{"$f":"IFERROR(LEFT(N31,FIND(\" \",$N31)-1),\"\")","v":""},{"$f":"IFERROR(INDEX(Angebote!$J:$J,MATCH($O31,OFFSET(Liste_Angebote,0,1),0)+ROW(Liste_Angebote)-1),\"\")","v":""},null,null,null,null,null,null,null,null,null,null,null,null,null,null,null,null,null,null,null,null,null,null,null,null,null,null,null,null,0,null,0,{"$f":"IF(AND($AU31<>0,COUNTIF($AU$2:$AU31,\"<>0\")<>OFFSET(AV31,-1,0)),COUNTIF($AU$2:$AU31,\"<>0\"),\"\")","v":""},{"$f":"IF(AND(_xlfn.ISFORMULA($AS31),ISBLANK($AR31),NOT(ISBLANK($S31))),\"Noch nicht abgerechnet; Kosten gemäss Offerte\",\"\")","v":""},{"$f":"IFERROR(IF($Q31=\"\",\"\",IF(AND(YEAR($Q31)+IF(MONTH(TODAY())<4,1,0)<YEAR(TODAY()),$AR31<>\"\"),YEAR($Q31),IF(AND(YEAR($Q31)<YEAR(TODAY()),R31<TODAY()-183),YEAR($Q31),\"\"))),\"\")","v":""},{"$f":"IFERROR(IF(_xlfn.CONCAT($A31:$AR31,TEXT($AS31,\"0;-0;;@\"),$AT31,TEXT($AU31,\"0;-0;;@\"),$AW31)=\"\",IF(AND(ROW(AY31)>2,OFFSET(AY31,1,0)<>\"\"),\"^\",\"\"),\"×\"),\"\")","v":""},{"$f":"IF($A31&$B31=\"\",\"\",OFFSET(AZ31,-1,0))","v":""},{"$f":"IFERROR(VLOOKUP($AZ31,'SLT-Leistungsklasse'!$A:$H,5,FALSE),IF($A31 & $B31 & $C31=\"\",\"\",OFFSET(BA31,-1,0)))","v":""},{"$f":"IFERROR(INDEX(OFFSET(ZH,0,-1),MATCH($BA31,ZH,0)),\"\")","v":""},{"$f":"IFERROR(IF(OR($BB31=\"\",$Q31 < DATE(2000,1,1)),\"\",$BB31 & \"·\" & YEAR($Q31)),\"\")","v":""},{"$f":"IF(OR($H31=0,$H31=3,$H31=4),$BC31,\"\")","v":""},{"$f":"IFERROR(VLOOKUP($AZ31,'SLT-Leistungsklasse'!A:B,2,FALSE),\"\")","v":""},{"$f":"IFERROR(IF(AND($BA31<>\"\",$AZ31<>\"\"),IFERROR(INDEX(OFFSET(ZH,0,-2),MATCH($BA31,ZH,0)),\"\"),\"\"),\"\")","v":""},"f4ek-xhf"]
[null,null,null,null,{"$f":"IFERROR(INDEX(OFFSET(Liste_Geschlecht,0,-1),MATCH($D32,Liste_Geschlecht,0)),\"\")","v":""},null,null,{"$f":"IFERROR(INDEX(OFFSET(Liste_Aufenthaltsstatus,0,-1),MATCH($G32,Liste_Aufenthaltsstatus,0)),\"\")","v":""},null,{"$f":"IFERROR(INDEX(OFFSET(Staaten,0,-1),MATCH($I32,Staaten,0)),\"\")","v":""},null,null,null,null,{"$f":"IFERROR(LEFT(N32,FIND(\" \",$N32)-1),\"\")","v":""},{"$f":"IFERROR(INDEX(Angebote!$J:$J,MATCH($O32,OFFSET(Liste_Angebote,0,1),0)+ROW(Liste_Angebote)-1),\"\")","v":""},null,null,null,null,null,null,null,null,null,null,null,null,null,null,null,null,null,null,null,null,null,null,null,null,null,null,null,null,0,null,0,{"$f":"IF(AND($AU32<>0,COUNTIF($AU$2:$AU32,\"<>0\")<>OFFSET(AV32,-1,0)),COUNTIF($AU$2:$AU32,\"<>0\"),\"\")","v":""},{"$f":"IF(AND(_xlfn.ISFORMULA($AS32),ISBLANK($AR32),NOT(ISBLANK($S32))),\"Noch nicht abgerechnet; Kosten gemäss Offerte\",\"\")","v":""},{"$f":"IFERROR(IF($Q32=\"\",\"\",IF(AND(YEAR($Q32)+IF(MONTH(TODAY())<4,1,0)<YEAR(TODAY()),$AR32<>\"\"),YEAR($Q32),IF(AND(YEAR($Q32)<YEAR(TODAY()),R32<TODAY()-183),YEAR($Q32),\"\"))),\"\")","v":""},{"$f":"IFERROR(IF(_xlfn.CONCAT($A32:$AR32,TEXT($AS32,\"0;-0;;@\"),$AT32,TEXT($AU32,\"0;-0;;@\"),$AW32)=\"\",IF(AND(ROW(AY32)>2,OFFSET(AY32,1,0)<>\"\"),\"^\",\"\"),\"×\"),\"\")","v":""},{"$f":"IF($A32&$B32=\"\",\"\",OFFSET(AZ32,-1,0))","v":""},{"$f":"IFERROR(VLOOKUP($AZ32,'SLT-Leistungsklasse'!$A:$H,5,FALSE),IF($A32 & $B32 & $C32=\"\",\"\",OFFSET(BA32,-1,0)))","v":""},{"$f":"IFERROR(INDEX(OFFSET(ZH,0,-1),MATCH($BA32,ZH,0)),\"\")","v":""},{"$f":"IFERROR(IF(OR($BB32=\"\",$Q32 < DATE(2000,1,1)),\"\",$BB32 & \"·\" & YEAR($Q32)),\"\")","v":""},{"$f":"IF(OR($H32=0,$H32=3,$H32=4),$BC32,\"\")","v":""},{"$f":"IFERROR(VLOOKUP($AZ32,'SLT-Leistungsklasse'!A:B,2,FALSE),\"\")","v":""},{"$f":"IFERROR(IF(AND($BA32<>\"\",$AZ32<>\"\"),IFERROR(INDEX(OFFSET(ZH,0,-2),MATCH($BA32,ZH,0)),\"\"),\"\"),\"\")","v":""},"rkvr-rpj"]
[null,null,null,null,{"$f":"IFERROR(INDEX(OFFSET(Liste_Geschlecht,0,-1),MATCH($D33,Liste_Geschlecht,0)),\"\")","v":""},null,null,{"$f":"IFERROR(INDEX(OFFSET(Liste_Aufenthaltsstatus,0,-1),MATCH($G33,Liste_Aufenthaltsstatus,0)),\"\")","v":""},null,{"$f":"IFERROR(INDEX(OFFSET(Staaten,0,-1),MATCH($I33,Staaten,0)),\"\")","v":""},null,null,null,null,{"$f":"IFERROR(LEFT(N33,FIND(\" \",$N33)-1),\"\")","v":""},{"$f":"IFERROR(INDEX(Angebote!$J:$J,MATCH($O33,OFFSET(Liste_Angebote,0,1),0)+ROW(Liste_Angebote)-1),\"\")","v":""},null,null,null,null,null,null,null,null,null,null,null,null,null,null,null,null,null,null,null,null,null,null,null,null,null,null,null,null,0,null,0,{"$f":"IF(AND($AU33<>0,COUNTIF($AU$2:$AU33,\"<>0\")<>OFFSET(AV33,-1,0)),COUNTIF($AU$2:$AU33,\"<>0\"),\"\")","v":""},{"$f":"IF(AND(_xlfn.ISFORMULA($AS33),ISBLANK($AR33),NOT(ISBLANK($S33))),\"Noch nicht abgerechnet; Kosten gemäss Offerte\",\"\")","v":""},{"$f":"IFERROR(IF($Q33=\"\",\"\",IF(AND(YEAR($Q33)+IF(MONTH(TODAY())<4,1,0)<YEAR(TODAY()),$AR33<>\"\"),YEAR($Q33),IF(AND(YEAR($Q33)<YEAR(TODAY()),R33<TODAY()-183),YEAR($Q33),\"\"))),\"\")","v":""},{"$f":"IFERROR(IF(_xlfn.CONCAT($A33:$AR33,TEXT($AS33,\"0;-0;;@\"),$AT33,TEXT($AU33,\"0;-0;;@\"),$AW33)=\"\",IF(AND(ROW(AY33)>2,OFFSET(AY33,1,0)<>\"\"),\"^\",\"\"),\"×\"),\"\")","v":""},{"$f":"IF($A33&$B33=\"\",\"\",OFFSET(AZ33,-1,0))","v":""},{"$f":"IFERROR(VLOOKUP($AZ33,'SLT-Leistungsklasse'!$A:$H,5,FALSE),IF($A33 & $B33 & $C33=\"\",\"\",OFFSET(BA33,-1,0)))","v":""},{"$f":"IFERROR(INDEX(OFFSET(ZH,0,-1),MATCH($BA33,ZH,0)),\"\")","v":""},{"$f":"IFERROR(IF(OR($BB33=\"\",$Q33 < DATE(2000,1,1)),\"\",$BB33 & \"·\" & YEAR($Q33)),\"\")","v":""},{"$f":"IF(OR($H33=0,$H33=3,$H33=4),$BC33,\"\")","v":""},{"$f":"IFERROR(VLOOKUP($AZ33,'SLT-Leistungsklasse'!A:B,2,FALSE),\"\")","v":""},{"$f":"IFERROR(IF(AND($BA33<>\"\",$AZ33<>\"\"),IFERROR(INDEX(OFFSET(ZH,0,-2),MATCH($BA33,ZH,0)),\"\"),\"\"),\"\")","v":""},"y5lr-ine"]
[null,null,null,null,{"$f":"IFERROR(INDEX(OFFSET(Liste_Geschlecht,0,-1),MATCH($D34,Liste_Geschlecht,0)),\"\")","v":""},null,null,{"$f":"IFERROR(INDEX(OFFSET(Liste_Aufenthaltsstatus,0,-1),MATCH($G34,Liste_Aufenthaltsstatus,0)),\"\")","v":""},null,{"$f":"IFERROR(INDEX(OFFSET(Staaten,0,-1),MATCH($I34,Staaten,0)),\"\")","v":""},null,null,null,null,{"$f":"IFERROR(LEFT(N34,FIND(\" \",$N34)-1),\"\")","v":""},{"$f":"IFERROR(INDEX(Angebote!$J:$J,MATCH($O34,OFFSET(Liste_Angebote,0,1),0)+ROW(Liste_Angebote)-1),\"\")","v":""},null,null,null,null,null,null,null,null,null,null,null,null,null,null,null,null,null,null,null,null,null,null,null,null,null,null,null,null,0,null,0,{"$f":"IF(AND($AU34<>0,COUNTIF($AU$2:$AU34,\"<>0\")<>OFFSET(AV34,-1,0)),COUNTIF($AU$2:$AU34,\"<>0\"),\"\")","v":""},{"$f":"IF(AND(_xlfn.ISFORMULA($AS34),ISBLANK($AR34),NOT(ISBLANK($S34))),\"Noch nicht abgerechnet; Kosten gemäss Offerte\",\"\")","v":""},{"$f":"IFERROR(IF($Q34=\"\",\"\",IF(AND(YEAR($Q34)+IF(MONTH(TODAY())<4,1,0)<YEAR(TODAY()),$AR34<>\"\"),YEAR($Q34),IF(AND(YEAR($Q34)<YEAR(TODAY()),R34<TODAY()-183),YEAR($Q34),\"\"))),\"\")","v":""},{"$f":"IFERROR(IF(_xlfn.CONCAT($A34:$AR34,TEXT($AS34,\"0;-0;;@\"),$AT34,TEXT($AU34,\"0;-0;;@\"),$AW34)=\"\",IF(AND(ROW(AY34)>2,OFFSET(AY34,1,0)<>\"\"),\"^\",\"\"),\"×\"),\"\")","v":""},{"$f":"IF($A34&$B34=\"\",\"\",OFFSET(AZ34,-1,0))","v":""},{"$f":"IFERROR(VLOOKUP($AZ34,'SLT-Leistungsklasse'!$A:$H,5,FALSE),IF($A34 & $B34 & $C34=\"\",\"\",OFFSET(BA34,-1,0)))","v":""},{"$f":"IFERROR(INDEX(OFFSET(ZH,0,-1),MATCH($BA34,ZH,0)),\"\")","v":""},{"$f":"IFERROR(IF(OR($BB34=\"\",$Q34 < DATE(2000,1,1)),\"\",$BB34 & \"·\" & YEAR($Q34)),\"\")","v":""},{"$f":"IF(OR($H34=0,$H34=3,$H34=4),$BC34,\"\")","v":""},{"$f":"IFERROR(VLOOKUP($AZ34,'SLT-Leistungsklasse'!A:B,2,FALSE),\"\")","v":""},{"$f":"IFERROR(IF(AND($BA34<>\"\",$AZ34<>\"\"),IFERROR(INDEX(OFFSET(ZH,0,-2),MATCH($BA34,ZH,0)),\"\"),\"\"),\"\")","v":""},"vuyt-ee4"]
[null,null,null,null,{"$f":"IFERROR(INDEX(OFFSET(Liste_Geschlecht,0,-1),MATCH($D35,Liste_Geschlecht,0)),\"\")","v":""},null,null,{"$f":"IFERROR(INDEX(OFFSET(Liste_Aufenthaltsstatus,0,-1),MATCH($G35,Liste_Aufenthaltsstatus,0)),\"\")","v":""},null,{"$f":"IFERROR(INDEX(OFFSET(Staaten,0,-1),MATCH($I35,Staaten,0)),\"\")","v":""},null,null,null,null,{"$f":"IFERROR(LEFT(N35,FIND(\" \",$N35)-1),\"\")","v":""},{"$f":"IFERROR(INDEX(Angebote!$J:$J,MATCH($O35,OFFSET(Liste_Angebote,0,1),0)+ROW(Liste_Angebote)-1),\"\")","v":""},null,null,null,null,null,null,null,null,null,null,null,null,null,null,null,null,null,null,null,null,null,null,null,null,null,null,null,null,{"$f":"IF(AND(ISBLANK($AR35),ISNUMBER($S35)),$S35,IF(SUM($U35,$W35,$Y35,$AA35,$AC35,$AE35,$AG35,$AI35,$AK35,$AM35,$AO35,$AQ35)<>0,SUM($U35,$W35,$Y35,$AA35,$AC35,$AE35,$AG35,$AI35,$AK35,$AM35,$AO35,$AQ35),$S35))","v":0},null,{"$f":"IF(ISNUMBER(AT35),AT35-AS35,0)","v":0},{"$f":"IF(AND($AU35<>0,COUNTIF($AU$2:$AU35,\"<>0\")<>OFFSET(AV35,-1,0)),COUNTIF($AU$2:$AU35,\"<>0\"),\"\")","v":""},{"$f":"IF(AND(_xlfn.ISFORMULA($AS35),ISBLANK($AR35),NOT(ISBLANK($S35))),\"Noch nicht abgerechnet; Kosten gemäss Offerte\",\"\")","v":""},{"$f":"IFERROR(IF($Q35=\"\",\"\",IF(AND(YEAR($Q35)+IF(MONTH(TODAY())<4,1,0)<YEAR(TODAY()),$AR35<>\"\"),YEAR($Q35),IF(AND(YEAR($Q35)<YEAR(TODAY()),R35<TODAY()-183),YEAR($Q35),\"\"))),\"\")","v":""},{"$f":"IFERROR(IF(_xlfn.CONCAT($A35:$AR35,TEXT($AS35,\"0;-0;;@\"),$AT35,TEXT($AU35,\"0;-0;;@\"),$AW35)=\"\",IF(AND(ROW(AY35)>2,OFFSET(AY35,1,0)<>\"\"),\"^\",\"\"),\"×\"),\"\")","v":""},{"$f":"IF($A35&$B35=\"\",\"\",OFFSET(AZ35,-1,0))","v":""},{"$f":"IFERROR(VLOOKUP($AZ35,'SLT-Leistungsklasse'!$A:$H,5,FALSE),IF($A35 & $B35 & $C35=\"\",\"\",OFFSET(BA35,-1,0)))","v":""},{"$f":"IFERROR(INDEX(OFFSET(ZH,0,-1),MATCH($BA35,ZH,0)),\"\")","v":""},{"$f":"IFERROR(IF(OR($BB35=\"\",$Q35 < DATE(2000,1,1)),\"\",$BB35 & \"·\" & YEAR($Q35)),\"\")","v":""},{"$f":"IF(OR($H35=0,$H35=3,$H35=4),$BC35,\"\")","v":""},{"$f":"IFERROR(VLOOKUP($AZ35,'SLT-Leistungsklasse'!A:B,2,FALSE),\"\")","v":""},{"$f":"IFERROR(IF(AND($BA35<>\"\",$AZ35<>\"\"),IFERROR(INDEX(OFFSET(ZH,0,-2),MATCH($BA35,ZH,0)),\"\"),\"\"),\"\")","v":""},"nqg8-0cx"]
[null,null,null,null,{"$f":"IFERROR(INDEX(OFFSET(Liste_Geschlecht,0,-1),MATCH($D36,Liste_Geschlecht,0)),\"\")","v":""},null,null,{"$f":"IFERROR(INDEX(OFFSET(Liste_Aufenthaltsstatus,0,-1),MATCH($G36,Liste_Aufenthaltsstatus,0)),\"\")","v":""},null,{"$f":"IFERROR(INDEX(OFFSET(Staaten,0,-1),MATCH($I36,Staaten,0)),\"\")","v":""},null,null,null,null,{"$f":"IFERROR(LEFT(N36,FIND(\" \",$N36)-1),\"\")","v":""},{"$f":"IFERROR(INDEX(Angebote!$J:$J,MATCH($O36,OFFSET(Liste_Angebote,0,1),0)+ROW(Liste_Angebote)-1),\"\")","v":""},null,null,null,null,null,null,null,null,null,null,null,null,null,null,null,null,null,null,null,null,null,null,null,null,null,null,null,null,0,null,0,{"$f":"IF(AND($AU36<>0,COUNTIF($AU$2:$AU36,\"<>0\")<>OFFSET(AV36,-1,0)),COUNTIF($AU$2:$AU36,\"<>0\"),\"\")","v":""},{"$f":"IF(AND(_xlfn.ISFORMULA($AS36),ISBLANK($AR36),NOT(ISBLANK($S36))),\"Noch nicht abgerechnet; Kosten gemäss Offerte\",\"\")","v":""},{"$f":"IFERROR(IF($Q36=\"\",\"\",IF(AND(YEAR($Q36)+IF(MONTH(TODAY())<4,1,0)<YEAR(TODAY()),$AR36<>\"\"),YEAR($Q36),IF(AND(YEAR($Q36)<YEAR(TODAY()),R36<TODAY()-183),YEAR($Q36),\"\"))),\"\")","v":""},{"$f":"IFERROR(IF(_xlfn.CONCAT($A36:$AR36,TEXT($AS36,\"0;-0;;@\"),$AT36,TEXT($AU36,\"0;-0;;@\"),$AW36)=\"\",IF(AND(ROW(AY36)>2,OFFSET(AY36,1,0)<>\"\"),\"^\",\"\"),\"×\"),\"\")","v":""},{"$f":"IF($A36&$B36=\"\",\"\",OFFSET(AZ36,-1,0))","v":""},{"$f":"IFERROR(VLOOKUP($AZ36,'SLT-Leistungsklasse'!$A:$H,5,FALSE),IF($A36 & $B36 & $C36=\"\",\"\",OFFSET(BA36,-1,0)))","v":""},{"$f":"IFERROR(INDEX(OFFSET(ZH,0,-1),MATCH($BA36,ZH,0)),\"\")","v":""},{"$f":"IFERROR(IF(OR($BB36=\"\",$Q36 < DATE(2000,1,1)),\"\",$BB36 & \"·\" & YEAR($Q36)),\"\")","v":""},{"$f":"IF(OR($H36=0,$H36=3,$H36=4),$BC36,\"\")","v":""},{"$f":"IFERROR(VLOOKUP($AZ36,'SLT-Leistungsklasse'!A:B,2,FALSE),\"\")","v":""},{"$f":"IFERROR(IF(AND($BA36<>\"\",$AZ36<>\"\"),IFERROR(INDEX(OFFSET(ZH,0,-2),MATCH($BA36,ZH,0)),\"\"),\"\"),\"\")","v":""},"fjrv-cyu"]
[null,null,null,null,{"$f":"IFERROR(INDEX(OFFSET(Liste_Geschlecht,0,-1),MATCH($D37,Liste_Geschlecht,0)),\"\")","v":""},null,null,{"$f":"IFERROR(INDEX(OFFSET(Liste_Aufenthaltsstatus,0,-1),MATCH($G37,Liste_Aufenthaltsstatus,0)),\"\")","v":""},null,{"$f":"IFERROR(INDEX(OFFSET(Staaten,0,-1),MATCH($I37,Staaten,0)),\"\")","v":""},null,null,null,null,{"$f":"IFERROR(LEFT(N37,FIND(\" \",$N37)-1),\"\")","v":""},{"$f":"IFERROR(INDEX(Angebote!$J:$J,MATCH($O37,OFFSET(Liste_Angebote,0,1),0)+ROW(Liste_Angebote)-1),\"\")","v":""},null,null,null,null,null,null,null,null,null,null,null,null,null,null,null,null,null,null,null,null,null,null,null,null,null,null,null,null,0,null,0,{"$f":"IF(AND($AU37<>0,COUNTIF($AU$2:$AU37,\"<>0\")<>OFFSET(AV37,-1,0)),COUNTIF($AU$2:$AU37,\"<>0\"),\"\")","v":""},{"$f":"IF(AND(_xlfn.ISFORMULA($AS37),ISBLANK($AR37),NOT(ISBLANK($S37))),\"Noch nicht abgerechnet; Kosten gemäss Offerte\",\"\")","v":""},{"$f":"IFERROR(IF($Q37=\"\",\"\",IF(AND(YEAR($Q37)+IF(MONTH(TODAY())<4,1,0)<YEAR(TODAY()),$AR37<>\"\"),YEAR($Q37),IF(AND(YEAR($Q37)<YEAR(TODAY()),R37<TODAY()-183),YEAR($Q37),\"\"))),\"\")","v":""},{"$f":"IFERROR(IF(_xlfn.CONCAT($A37:$AR37,TEXT($AS37,\"0;-0;;@\"),$AT37,TEXT($AU37,\"0;-0;;@\"),$AW37)=\"\",IF(AND(ROW(AY37)>2,OFFSET(AY37,1,0)<>\"\"),\"^\",\"\"),\"×\"),\"\")","v":""},{"$f":"IF($A37&$B37=\"\",\"\",OFFSET(AZ37,-1,0))","v":""},{"$f":"IFERROR(VLOOKUP($AZ37,'SLT-Leistungsklasse'!$A:$H,5,FALSE),IF($A37 & $B37 & $C37=\"\",\"\",OFFSET(BA37,-1,0)))","v":""},{"$f":"IFERROR(INDEX(OFFSET(ZH,0,-1),MATCH($BA37,ZH,0)),\"\")","v":""},{"$f":"IFERROR(IF(OR($BB37=\"\",$Q37 < DATE(2000,1,1)),\"\",$BB37 & \"·\" & YEAR($Q37)),\"\")","v":""},{"$f":"IF(OR($H37=0,$H37=3,$H37=4),$BC37,\"\")","v":""},{"$f":"IFERROR(VLOOKUP($AZ37,'SLT-Leistungsklasse'!A:B,2,FALSE),\"\")","v":""},{"$f":"IFERROR(IF(AND($BA37<>\"\",$AZ37<>\"\"),IFERROR(INDEX(OFFSET(ZH,0,-2),MATCH($BA37,ZH,0)),\"\"),\"\"),\"\")","v":""},"o51t-d3b"]
[null,null,null,null,{"$f":"IFERROR(INDEX(OFFSET(Liste_Geschlecht,0,-1),MATCH($D38,Liste_Geschlecht,0)),\"\")","v":""},null,null,{"$f":"IFERROR(INDEX(OFFSET(Liste_Aufenthaltsstatus,0,-1),MATCH($G38,Liste_Aufenthaltsstatus,0)),\"\")","v":""},null,{"$f":"IFERROR(INDEX(OFFSET(Staaten,0,-1),MATCH($I38,Staaten,0)),\"\")","v":""},null,null,null,null,{"$f":"IFERROR(LEFT(N38,FIND(\" \",$N38)-1),\"\")","v":""},{"$f":"IFERROR(INDEX(Angebote!$J:$J,MATCH($O38,OFFSET(Liste_Angebote,0,1),0)+ROW(Liste_Angebote)-1),\"\")","v":""},null,null,null,null,null,null,null,null,null,null,null,null,null,null,null,null,null,null,null,null,null,null,null,null,null,null,null,null,0,null,0,{"$f":"IF(AND($AU38<>0,COUNTIF($AU$2:$AU38,\"<>0\")<>OFFSET(AV38,-1,0)),COUNTIF($AU$2:$AU38,\"<>0\"),\"\")","v":""},{"$f":"IF(AND(_xlfn.ISFORMULA($AS38),ISBLANK($AR38),NOT(ISBLANK($S38))),\"Noch nicht abgerechnet; Kosten gemäss Offerte\",\"\")","v":""},{"$f":"IFERROR(IF($Q38=\"\",\"\",IF(AND(YEAR($Q38)+IF(MONTH(TODAY())<4,1,0)<YEAR(TODAY()),$AR38<>\"\"),YEAR($Q38),IF(AND(YEAR($Q38)<YEAR(TODAY()),R38<TODAY()-183),YEAR($Q38),\"\"))),\"\")","v":""},{"$f":"IFERROR(IF(_xlfn.CONCAT($A38:$AR38,TEXT($AS38,\"0;-0;;@\"),$AT38,TEXT($AU38,\"0;-0;;@\"),$AW38)=\"\",IF(AND(ROW(AY38)>2,OFFSET(AY38,1,0)<>\"\"),\"^\",\"\"),\"×\"),\"\")","v":""},{"$f":"IF($A38&$B38=\"\",\"\",OFFSET(AZ38,-1,0))","v":""},{"$f":"IFERROR(VLOOKUP($AZ38,'SLT-Leistungsklasse'!$A:$H,5,FALSE),IF($A38 & $B38 & $C38=\"\",\"\",OFFSET(BA38,-1,0)))","v":""},{"$f":"IFERROR(INDEX(OFFSET(ZH,0,-1),MATCH($BA38,ZH,0)),\"\")","v":""},{"$f":"IFERROR(IF(OR($BB38=\"\",$Q38 < DATE(2000,1,1)),\"\",$BB38 & \"·\" & YEAR($Q38)),\"\")","v":""},{"$f":"IF(OR($H38=0,$H38=3,$H38=4),$BC38,\"\")","v":""},{"$f":"IFERROR(VLOOKUP($AZ38,'SLT-Leistungsklasse'!A:B,2,FALSE),\"\")","v":""},{"$f":"IFERROR(IF(AND($BA38<>\"\",$AZ38<>\"\"),IFERROR(INDEX(OFFSET(ZH,0,-2),MATCH($BA38,ZH,0)),\"\"),\"\"),\"\")","v":""},"rski-xr0"]
[null,null,null,null,{"$f":"IFERROR(INDEX(OFFSET(Liste_Geschlecht,0,-1),MATCH($D39,Liste_Geschlecht,0)),\"\")","v":""},null,null,{"$f":"IFERROR(INDEX(OFFSET(Liste_Aufenthaltsstatus,0,-1),MATCH($G39,Liste_Aufenthaltsstatus,0)),\"\")","v":""},null,{"$f":"IFERROR(INDEX(OFFSET(Staaten,0,-1),MATCH($I39,Staaten,0)),\"\")","v":""},null,null,null,null,{"$f":"IFERROR(LEFT(N39,FIND(\" \",$N39)-1),\"\")","v":""},{"$f":"IFERROR(INDEX(Angebote!$J:$J,MATCH($O39,OFFSET(Liste_Angebote,0,1),0)+ROW(Liste_Angebote)-1),\"\")","v":""},null,null,null,null,null,null,null,null,null,null,null,null,null,null,null,null,null,null,null,null,null,null,null,null,null,null,null,null,0,null,0,{"$f":"IF(AND($AU39<>0,COUNTIF($AU$2:$AU39,\"<>0\")<>OFFSET(AV39,-1,0)),COUNTIF($AU$2:$AU39,\"<>0\"),\"\")","v":""},{"$f":"IF(AND(_xlfn.ISFORMULA($AS39),ISBLANK($AR39),NOT(ISBLANK($S39))),\"Noch nicht abgerechnet; Kosten gemäss Offerte\",\"\")","v":""},{"$f":"IFERROR(IF($Q39=\"\",\"\",IF(AND(YEAR($Q39)+IF(MONTH(TODAY())<4,1,0)<YEAR(TODAY()),$AR39<>\"\"),YEAR($Q39),IF(AND(YEAR($Q39)<YEAR(TODAY()),R39<TODAY()-183),YEAR($Q39),\"\"))),\"\")","v":""},{"$f":"IFERROR(IF(_xlfn.CONCAT($A39:$AR39,TEXT($AS39,\"0;-0;;@\"),$AT39,TEXT($AU39,\"0;-0;;@\"),$AW39)=\"\",IF(AND(ROW(AY39)>2,OFFSET(AY39,1,0)<>\"\"),\"^\",\"\"),\"×\"),\"\")","v":""},{"$f":"IF($A39&$B39=\"\",\"\",OFFSET(AZ39,-1,0))","v":""},{"$f":"IFERROR(VLOOKUP($AZ39,'SLT-Leistungsklasse'!$A:$H,5,FALSE),IF($A39 & $B39 & $C39=\"\",\"\",OFFSET(BA39,-1,0)))","v":""},{"$f":"IFERROR(INDEX(OFFSET(ZH,0,-1),MATCH($BA39,ZH,0)),\"\")","v":""},{"$f":"IFERROR(IF(OR($BB39=\"\",$Q39 < DATE(2000,1,1)),\"\",$BB39 & \"·\" & YEAR($Q39)),\"\")","v":""},{"$f":"IF(OR($H39=0,$H39=3,$H39=4),$BC39,\"\")","v":""},{"$f":"IFERROR(VLOOKUP($AZ39,'SLT-Leistungsklasse'!A:B,2,FALSE),\"\")","v":""},{"$f":"IFERROR(IF(AND($BA39<>\"\",$AZ39<>\"\"),IFERROR(INDEX(OFFSET(ZH,0,-2),MATCH($BA39,ZH,0)),\"\"),\"\"),\"\")","v":""},"4mef-176"]
[null,null,null,null,{"$f":"IFERROR(INDEX(OFFSET(Liste_Geschlecht,0,-1),MATCH($D40,Liste_Geschlecht,0)),\"\")","v":""},null,null,{"$f":"IFERROR(INDEX(OFFSET(Liste_Aufenthaltsstatus,0,-1),MATCH($G40,Liste_Aufenthaltsstatus,0)),\"\")","v":""},null,{"$f":"IFERROR(INDEX(OFFSET(Staaten,0,-1),MATCH($I40,Staaten,0)),\"\")","v":""},null,null,null,null,{"$f":"IFERROR(LEFT(N40,FIND(\" \",$N40)-1),\"\")","v":""},{"$f":"IFERROR(INDEX(Angebote!$J:$J,MATCH($O40,OFFSET(Liste_Angebote,0,1),0)+ROW(Liste_Angebote)-1),\"\")","v":""},null,null,null,null,null,null,null,null,null,null,null,null,null,null,null,null,null,null,null,null,null,null,null,null,null,null,null,null,0,null,0,{"$f":"IF(AND($AU40<>0,COUNTIF($AU$2:$AU40,\"<>0\")<>OFFSET(AV40,-1,0)),COUNTIF($AU$2:$AU40,\"<>0\"),\"\")","v":""},{"$f":"IF(AND(_xlfn.ISFORMULA($AS40),ISBLANK($AR40),NOT(ISBLANK($S40))),\"Noch nicht abgerechnet; Kosten gemäss Offerte\",\"\")","v":""},{"$f":"IFERROR(IF($Q40=\"\",\"\",IF(AND(YEAR($Q40)+IF(MONTH(TODAY())<4,1,0)<YEAR(TODAY()),$AR40<>\"\"),YEAR($Q40),IF(AND(YEAR($Q40)<YEAR(TODAY()),R40<TODAY()-183),YEAR($Q40),\"\"))),\"\")","v":""},{"$f":"IFERROR(IF(_xlfn.CONCAT($A40:$AR40,TEXT($AS40,\"0;-0;;@\"),$AT40,TEXT($AU40,\"0;-0;;@\"),$AW40)=\"\",IF(AND(ROW(AY40)>2,OFFSET(AY40,1,0)<>\"\"),\"^\",\"\"),\"×\"),\"\")","v":""},{"$f":"IF($A40&$B40=\"\",\"\",OFFSET(AZ40,-1,0))","v":""},{"$f":"IFERROR(VLOOKUP($AZ40,'SLT-Leistungsklasse'!$A:$H,5,FALSE),IF($A40 & $B40 & $C40=\"\",\"\",OFFSET(BA40,-1,0)))","v":""},{"$f":"IFERROR(INDEX(OFFSET(ZH,0,-1),MATCH($BA40,ZH,0)),\"\")","v":""},{"$f":"IFERROR(IF(OR($BB40=\"\",$Q40 < DATE(2000,1,1)),\"\",$BB40 & \"·\" & YEAR($Q40)),\"\")","v":""},{"$f":"IF(OR($H40=0,$H40=3,$H40=4),$BC40,\"\")","v":""},{"$f":"IFERROR(VLOOKUP($AZ40,'SLT-Leistungsklasse'!A:B,2,FALSE),\"\")","v":""},{"$f":"IFERROR(IF(AND($BA40<>\"\",$AZ40<>\"\"),IFERROR(INDEX(OFFSET(ZH,0,-2),MATCH($BA40,ZH,0)),\"\"),\"\"),\"\")","v":""},"1143-e70"]
[null,null,null,null,{"$f":"IFERROR(INDEX(OFFSET(Liste_Geschlecht,0,-1),MATCH($D41,Liste_Geschlecht,0)),\"\")","v":""},null,null,{"$f":"IFERROR(INDEX(OFFSET(Liste_Aufenthaltsstatus,0,-1),MATCH($G41,Liste_Aufenthaltsstatus,0)),\"\")","v":""},null,{"$f":"IFERROR(INDEX(OFFSET(Staaten,0,-1),MATCH($I41,Staaten,0)),\"\")","v":""},null,null,null,null,{"$f":"IFERROR(LEFT(N41,FIND(\" \",$N41)-1),\"\")","v":""},{"$f":"IFERROR(INDEX(Angebote!$J:$J,MATCH($O41,OFFSET(Liste_Angebote,0,1),0)+ROW(Liste_Angebote)-1),\"\")","v":""},null,null,null,null,null,null,null,null,null,null,null,null,null,null,null,null,null,null,null,null,null,null,null,null,null,null,null,null,0,null,0,{"$f":"IF(AND($AU41<>0,COUNTIF($AU$2:$AU41,\"<>0\")<>OFFSET(AV41,-1,0)),COUNTIF($AU$2:$AU41,\"<>0\"),\"\")","v":""},{"$f":"IF(AND(_xlfn.ISFORMULA($AS41),ISBLANK($AR41),NOT(ISBLANK($S41))),\"Noch nicht abgerechnet; Kosten gemäss Offerte\",\"\")","v":""},{"$f":"IFERROR(IF($Q41=\"\",\"\",IF(AND(YEAR($Q41)+IF(MONTH(TODAY())<4,1,0)<YEAR(TODAY()),$AR41<>\"\"),YEAR($Q41),IF(AND(YEAR($Q41)<YEAR(TODAY()),R41<TODAY()-183),YEAR($Q41),\"\"))),\"\")","v":""},{"$f":"IFERROR(IF(_xlfn.CONCAT($A41:$AR41,TEXT($AS41,\"0;-0;;@\"),$AT41,TEXT($AU41,\"0;-0;;@\"),$AW41)=\"\",IF(AND(ROW(AY41)>2,OFFSET(AY41,1,0)<>\"\"),\"^\",\"\"),\"×\"),\"\")","v":""},{"$f":"IF($A41&$B41=\"\",\"\",OFFSET(AZ41,-1,0))","v":""},{"$f":"IFERROR(VLOOKUP($AZ41,'SLT-Leistungsklasse'!$A:$H,5,FALSE),IF($A41 & $B41 & $C41=\"\",\"\",OFFSET(BA41,-1,0)))","v":""},{"$f":"IFERROR(INDEX(OFFSET(ZH,0,-1),MATCH($BA41,ZH,0)),\"\")","v":""},{"$f":"IFERROR(IF(OR($BB41=\"\",$Q41 < DATE(2000,1,1)),\"\",$BB41 & \"·\" & YEAR($Q41)),\"\")","v":""},{"$f":"IF(OR($H41=0,$H41=3,$H41=4),$BC41,\"\")","v":""},{"$f":"IFERROR(VLOOKUP($AZ41,'SLT-Leistungsklasse'!A:B,2,FALSE),\"\")","v":""},{"$f":"IFERROR(IF(AND($BA41<>\"\",$AZ41<>\"\"),IFERROR(INDEX(OFFSET(ZH,0,-2),MATCH($BA41,ZH,0)),\"\"),\"\"),\"\")","v":""},"klz5-ho1"]
[null,null,null,null,{"$f":"IFERROR(INDEX(OFFSET(Liste_Geschlecht,0,-1),MATCH($D42,Liste_Geschlecht,0)),\"\")","v":""},null,null,{"$f":"IFERROR(INDEX(OFFSET(Liste_Aufenthaltsstatus,0,-1),MATCH($G42,Liste_Aufenthaltsstatus,0)),\"\")","v":""},null,{"$f":"IFERROR(INDEX(OFFSET(Staaten,0,-1),MATCH($I42,Staaten,0)),\"\")","v":""},null,null,null,null,{"$f":"IFERROR(LEFT(N42,FIND(\" \",$N42)-1),\"\")","v":""},{"$f":"IFERROR(INDEX(Angebote!$J:$J,MATCH($O42,OFFSET(Liste_Angebote,0,1),0)+ROW(Liste_Angebote)-1),\"\")","v":""},null,null,null,null,null,null,null,null,null,null,null,null,null,null,null,null,null,null,null,null,null,null,null,null,null,null,null,null,0,null,0,{"$f":"IF(AND($AU42<>0,COUNTIF($AU$2:$AU42,\"<>0\")<>OFFSET(AV42,-1,0)),COUNTIF($AU$2:$AU42,\"<>0\"),\"\")","v":""},{"$f":"IF(AND(_xlfn.ISFORMULA($AS42),ISBLANK($AR42),NOT(ISBLANK($S42))),\"Noch nicht abgerechnet; Kosten gemäss Offerte\",\"\")","v":""},{"$f":"IFERROR(IF($Q42=\"\",\"\",IF(AND(YEAR($Q42)+IF(MONTH(TODAY())<4,1,0)<YEAR(TODAY()),$AR42<>\"\"),YEAR($Q42),IF(AND(YEAR($Q42)<YEAR(TODAY()),R42<TODAY()-183),YEAR($Q42),\"\"))),\"\")","v":""},{"$f":"IFERROR(IF(_xlfn.CONCAT($A42:$AR42,TEXT($AS42,\"0;-0;;@\"),$AT42,TEXT($AU42,\"0;-0;;@\"),$AW42)=\"\",IF(AND(ROW(AY42)>2,OFFSET(AY42,1,0)<>\"\"),\"^\",\"\"),\"×\"),\"\")","v":""},{"$f":"IF($A42&$B42=\"\",\"\",OFFSET(AZ42,-1,0))","v":""},{"$f":"IFERROR(VLOOKUP($AZ42,'SLT-Leistungsklasse'!$A:$H,5,FALSE),IF($A42 & $B42 & $C42=\"\",\"\",OFFSET(BA42,-1,0)))","v":""},{"$f":"IFERROR(INDEX(OFFSET(ZH,0,-1),MATCH($BA42,ZH,0)),\"\")","v":""},{"$f":"IFERROR(IF(OR($BB42=\"\",$Q42 < DATE(2000,1,1)),\"\",$BB42 & \"·\" & YEAR($Q42)),\"\")","v":""},{"$f":"IF(OR($H42=0,$H42=3,$H42=4),$BC42,\"\")","v":""},{"$f":"IFERROR(VLOOKUP($AZ42,'SLT-Leistungsklasse'!A:B,2,FALSE),\"\")","v":""},{"$f":"IFERROR(IF(AND($BA42<>\"\",$AZ42<>\"\"),IFERROR(INDEX(OFFSET(ZH,0,-2),MATCH($BA42,ZH,0)),\"\"),\"\"),\"\")","v":""},"f462-iuu"]
[null,null,null,null,{"$f":"IFERROR(INDEX(OFFSET(Liste_Geschlecht,0,-1),MATCH($D43,Liste_Geschlecht,0)),\"\")","v":""},null,null,{"$f":"IFERROR(INDEX(OFFSET(Liste_Aufenthaltsstatus,0,-1),MATCH($G43,Liste_Aufenthaltsstatus,0)),\"\")","v":""},null,{"$f":"IFERROR(INDEX(OFFSET(Staaten,0,-1),MATCH($I43,Staaten,0)),\"\")","v":""},null,null,null,null,{"$f":"IFERROR(LEFT(N43,FIND(\" \",$N43)-1),\"\")","v":""},{"$f":"IFERROR(INDEX(Angebote!$J:$J,MATCH($O43,OFFSET(Liste_Angebote,0,1),0)+ROW(Liste_Angebote)-1),\"\")","v":""},null,null,null,null,null,null,null,null,null,null,null,null,null,null,null,null,null,null,null,null,null,null,null,null,null,null,null,null,0,null,0,{"$f":"IF(AND($AU43<>0,COUNTIF($AU$2:$AU43,\"<>0\")<>OFFSET(AV43,-1,0)),COUNTIF($AU$2:$AU43,\"<>0\"),\"\")","v":""},{"$f":"IF(AND(_xlfn.ISFORMULA($AS43),ISBLANK($AR43),NOT(ISBLANK($S43))),\"Noch nicht abgerechnet; Kosten gemäss Offerte\",\"\")","v":""},{"$f":"IFERROR(IF($Q43=\"\",\"\",IF(AND(YEAR($Q43)+IF(MONTH(TODAY())<4,1,0)<YEAR(TODAY()),$AR43<>\"\"),YEAR($Q43),IF(AND(YEAR($Q43)<YEAR(TODAY()),R43<TODAY()-183),YEAR($Q43),\"\"))),\"\")","v":""},{"$f":"IFERROR(IF(_xlfn.CONCAT($A43:$AR43,TEXT($AS43,\"0;-0;;@\"),$AT43,TEXT($AU43,\"0;-0;;@\"),$AW43)=\"\",IF(AND(ROW(AY43)>2,OFFSET(AY43,1,0)<>\"\"),\"^\",\"\"),\"×\"),\"\")","v":""},{"$f":"IF($A43&$B43=\"\",\"\",OFFSET(AZ43,-1,0))","v":""},{"$f":"IFERROR(VLOOKUP($AZ43,'SLT-Leistungsklasse'!$A:$H,5,FALSE),IF($A43 & $B43 & $C43=\"\",\"\",OFFSET(BA43,-1,0)))","v":""},{"$f":"IFERROR(INDEX(OFFSET(ZH,0,-1),MATCH($BA43,ZH,0)),\"\")","v":""},{"$f":"IFERROR(IF(OR($BB43=\"\",$Q43 < DATE(2000,1,1)),\"\",$BB43 & \"·\" & YEAR($Q43)),\"\")","v":""},{"$f":"IF(OR($H43=0,$H43=3,$H43=4),$BC43,\"\")","v":""},{"$f":"IFERROR(VLOOKUP($AZ43,'SLT-Leistungsklasse'!A:B,2,FALSE),\"\")","v":""},{"$f":"IFERROR(IF(AND($BA43<>\"\",$AZ43<>\"\"),IFERROR(INDEX(OFFSET(ZH,0,-2),MATCH($BA43,ZH,0)),\"\"),\"\"),\"\")","v":""},"711f-4w3"]
[null,null,null,null,{"$f":"IFERROR(INDEX(OFFSET(Liste_Geschlecht,0,-1),MATCH($D44,Liste_Geschlecht,0)),\"\")","v":""},null,null,{"$f":"IFERROR(INDEX(OFFSET(Liste_Aufenthaltsstatus,0,-1),MATCH($G44,Liste_Aufenthaltsstatus,0)),\"\")","v":""},null,{"$f":"IFERROR(INDEX(OFFSET(Staaten,0,-1),MATCH($I44,Staaten,0)),\"\")","v":""},null,null,null,null,{"$f":"IFERROR(LEFT(N44,FIND(\" \",$N44)-1),\"\")","v":""},{"$f":"IFERROR(INDEX(Angebote!$J:$J,MATCH($O44,OFFSET(Liste_Angebote,0,1),0)+ROW(Liste_Angebote)-1),\"\")","v":""},null,null,null,null,null,null,null,null,null,null,null,null,null,null,null,null,null,null,null,null,null,null,null,null,null,null,null,null,0,null,0,{"$f":"IF(AND($AU44<>0,COUNTIF($AU$2:$AU44,\"<>0\")<>OFFSET(AV44,-1,0)),COUNTIF($AU$2:$AU44,\"<>0\"),\"\")","v":""},{"$f":"IF(AND(_xlfn.ISFORMULA($AS44),ISBLANK($AR44),NOT(ISBLANK($S44))),\"Noch nicht abgerechnet; Kosten gemäss Offerte\",\"\")","v":""},{"$f":"IFERROR(IF($Q44=\"\",\"\",IF(AND(YEAR($Q44)+IF(MONTH(TODAY())<4,1,0)<YEAR(TODAY()),$AR44<>\"\"),YEAR($Q44),IF(AND(YEAR($Q44)<YEAR(TODAY()),R44<TODAY()-183),YEAR($Q44),\"\"))),\"\")","v":""},{"$f":"IFERROR(IF(_xlfn.CONCAT($A44:$AR44,TEXT($AS44,\"0;-0;;@\"),$AT44,TEXT($AU44,\"0;-0;;@\"),$AW44)=\"\",IF(AND(ROW(AY44)>2,OFFSET(AY44,1,0)<>\"\"),\"^\",\"\"),\"×\"),\"\")","v":""},{"$f":"IF($A44&$B44=\"\",\"\",OFFSET(AZ44,-1,0))","v":""},{"$f":"IFERROR(VLOOKUP($AZ44,'SLT-Leistungsklasse'!$A:$H,5,FALSE),IF($A44 & $B44 & $C44=\"\",\"\",OFFSET(BA44,-1,0)))","v":""},{"$f":"IFERROR(INDEX(OFFSET(ZH,0,-1),MATCH($BA44,ZH,0)),\"\")","v":""},{"$f":"IFERROR(IF(OR($BB44=\"\",$Q44 < DATE(2000,1,1)),\"\",$BB44 & \"·\" & YEAR($Q44)),\"\")","v":""},{"$f":"IF(OR($H44=0,$H44=3,$H44=4),$BC44,\"\")","v":""},{"$f":"IFERROR(VLOOKUP($AZ44,'SLT-Leistungsklasse'!A:B,2,FALSE),\"\")","v":""},{"$f":"IFERROR(IF(AND($BA44<>\"\",$AZ44<>\"\"),IFERROR(INDEX(OFFSET(ZH,0,-2),MATCH($BA44,ZH,0)),\"\"),\"\"),\"\")","v":""},"2a0s-dox"]
[null,null,null,null,{"$f":"IFERROR(INDEX(OFFSET(Liste_Geschlecht,0,-1),MATCH($D45,Liste_Geschlecht,0)),\"\")","v":""},null,null,{"$f":"IFERROR(INDEX(OFFSET(Liste_Aufenthaltsstatus,0,-1),MATCH($G45,Liste_Aufenthaltsstatus,0)),\"\")","v":""},null,{"$f":"IFERROR(INDEX(OFFSET(Staaten,0,-1),MATCH($I45,Staaten,0)),\"\")","v":""},null,null,null,null,{"$f":"IFERROR(LEFT(N45,FIND(\" \",$N45)-1),\"\")","v":""},{"$f":"IFERROR(INDEX(Angebote!$J:$J,MATCH($O45,OFFSET(Liste_Angebote,0,1),0)+ROW(Liste_Angebote)-1),\"\")","v":""},null,null,null,null,null,null,null,null,null,null,null,null,null,null,null,null,null,null,null,null,null,null,null,null,null,null,null,null,0,null,0,{"$f":"IF(AND($AU45<>0,COUNTIF($AU$2:$AU45,\"<>0\")<>OFFSET(AV45,-1,0)),COUNTIF($AU$2:$AU45,\"<>0\"),\"\")","v":""},{"$f":"IF(AND(_xlfn.ISFORMULA($AS45),ISBLANK($AR45),NOT(ISBLANK($S45))),\"Noch nicht abgerechnet; Kosten gemäss Offerte\",\"\")","v":""},{"$f":"IFERROR(IF($Q45=\"\",\"\",IF(AND(YEAR($Q45)+IF(MONTH(TODAY())<4,1,0)<YEAR(TODAY()),$AR45<>\"\"),YEAR($Q45),IF(AND(YEAR($Q45)<YEAR(TODAY()),R45<TODAY()-183),YEAR($Q45),\"\"))),\"\")","v":""},{"$f":"IFERROR(IF(_xlfn.CONCAT($A45:$AR45,TEXT($AS45,\"0;-0;;@\"),$AT45,TEXT($AU45,\"0;-0;;@\"),$AW45)=\"\",IF(AND(ROW(AY45)>2,OFFSET(AY45,1,0)<>\"\"),\"^\",\"\"),\"×\"),\"\")","v":""},{"$f":"IF($A45&$B45=\"\",\"\",OFFSET(AZ45,-1,0))","v":""},{"$f":"IFERROR(VLOOKUP($AZ45,'SLT-Leistungsklasse'!$A:$H,5,FALSE),IF($A45 & $B45 & $C45=\"\",\"\",OFFSET(BA45,-1,0)))","v":""},{"$f":"IFERROR(INDEX(OFFSET(ZH,0,-1),MATCH($BA45,ZH,0)),\"\")","v":""},{"$f":"IFERROR(IF(OR($BB45=\"\",$Q45 < DATE(2000,1,1)),\"\",$BB45 & \"·\" & YEAR($Q45)),\"\")","v":""},{"$f":"IF(OR($H45=0,$H45=3,$H45=4),$BC45,\"\")","v":""},{"$f":"IFERROR(VLOOKUP($AZ45,'SLT-Leistungsklasse'!A:B,2,FALSE),\"\")","v":""},{"$f":"IFERROR(IF(AND($BA45<>\"\",$AZ45<>\"\"),IFERROR(INDEX(OFFSET(ZH,0,-2),MATCH($BA45,ZH,0)),\"\"),\"\"),\"\")","v":""},"kjjn-ju0"]
[null,null,null,null,{"$f":"IFERROR(INDEX(OFFSET(Liste_Geschlecht,0,-1),MATCH($D46,Liste_Geschlecht,0)),\"\")","v":""},null,null,{"$f":"IFERROR(INDEX(OFFSET(Liste_Aufenthaltsstatus,0,-1),MATCH($G46,Liste_Aufenthaltsstatus,0)),\"\")","v":""},null,{"$f":"IFERROR(INDEX(OFFSET(Staaten,0,-1),MATCH($I46,Staaten,0)),\"\")","v":""},null,null,null,null,{"$f":"IFERROR(LEFT(N46,FIND(\" \",$N46)-1),\"\")","v":""},{"$f":"IFERROR(INDEX(Angebote!$J:$J,MATCH($O46,OFFSET(Liste_Angebote,0,1),0)+ROW(Liste_Angebote)-1),\"\")","v":""},null,null,null,null,null,null,null,null,null,null,null,null,null,null,null,null,null,null,null,null,null,null,null,null,null,null,null,null,0,null,0,{"$f":"IF(AND($AU46<>0,COUNTIF($AU$2:$AU46,\"<>0\")<>OFFSET(AV46,-1,0)),COUNTIF($AU$2:$AU46,\"<>0\"),\"\")","v":""},{"$f":"IF(AND(_xlfn.ISFORMULA($AS46),ISBLANK($AR46),NOT(ISBLANK($S46))),\"Noch nicht abgerechnet; Kosten gemäss Offerte\",\"\")","v":""},{"$f":"IFERROR(IF($Q46=\"\",\"\",IF(AND(YEAR($Q46)+IF(MONTH(TODAY())<4,1,0)<YEAR(TODAY()),$AR46<>\"\"),YEAR($Q46),IF(AND(YEAR($Q46)<YEAR(TODAY()),R46<TODAY()-183),YEAR($Q46),\"\"))),\"\")","v":""},{"$f":"IFERROR(IF(_xlfn.CONCAT($A46:$AR46,TEXT($AS46,\"0;-0;;@\"),$AT46,TEXT($AU46,\"0;-0;;@\"),$AW46)=\"\",IF(AND(ROW(AY46)>2,OFFSET(AY46,1,0)<>\"\"),\"^\",\"\"),\"×\"),\"\")","v":""},{"$f":"IF($A46&$B46=\"\",\"\",OFFSET(AZ46,-1,0))","v":""},{"$f":"IFERROR(VLOOKUP($AZ46,'SLT-Leistungsklasse'!$A:$H,5,FALSE),IF($A46 & $B46 & $C46=\"\",\"\",OFFSET(BA46,-1,0)))","v":""},{"$f":"IFERROR(INDEX(OFFSET(ZH,0,-1),MATCH($BA46,ZH,0)),\"\")","v":""},{"$f":"IFERROR(IF(OR($BB46=\"\",$Q46 < DATE(2000,1,1)),\"\",$BB46 & \"·\" & YEAR($Q46)),\"\")","v":""},{"$f":"IF(OR($H46=0,$H46=3,$H46=4),$BC46,\"\")","v":""},{"$f":"IFERROR(VLOOKUP($AZ46,'SLT-Leistungsklasse'!A:B,2,FALSE),\"\")","v":""},{"$f":"IFERROR(IF(AND($BA46<>\"\",$AZ46<>\"\"),IFERROR(INDEX(OFFSET(ZH,0,-2),MATCH($BA46,ZH,0)),\"\"),\"\"),\"\")","v":""},"rpem-mlb"]
[null,null,null,null,{"$f":"IFERROR(INDEX(OFFSET(Liste_Geschlecht,0,-1),MATCH($D47,Liste_Geschlecht,0)),\"\")","v":""},null,null,{"$f":"IFERROR(INDEX(OFFSET(Liste_Aufenthaltsstatus,0,-1),MATCH($G47,Liste_Aufenthaltsstatus,0)),\"\")","v":""},null,{"$f":"IFERROR(INDEX(OFFSET(Staaten,0,-1),MATCH($I47,Staaten,0)),\"\")","v":""},null,null,null,null,{"$f":"IFERROR(LEFT(N47,FIND(\" \",$N47)-1),\"\")","v":""},{"$f":"IFERROR(INDEX(Angebote!$J:$J,MATCH($O47,OFFSET(Liste_Angebote,0,1),0)+ROW(Liste_Angebote)-1),\"\")","v":""},null,null,null,null,null,null,null,null,null,null,null,null,null,null,null,null,null,null,null,null,null,null,null,null,null,null,null,null,0,null,0,{"$f":"IF(AND($AU47<>0,COUNTIF($AU$2:$AU47,\"<>0\")<>OFFSET(AV47,-1,0)),COUNTIF($AU$2:$AU47,\"<>0\"),\"\")","v":""},{"$f":"IF(AND(_xlfn.ISFORMULA($AS47),ISBLANK($AR47),NOT(ISBLANK($S47))),\"Noch nicht abgerechnet; Kosten gemäss Offerte\",\"\")","v":""},{"$f":"IFERROR(IF($Q47=\"\",\"\",IF(AND(YEAR($Q47)+IF(MONTH(TODAY())<4,1,0)<YEAR(TODAY()),$AR47<>\"\"),YEAR($Q47),IF(AND(YEAR($Q47)<YEAR(TODAY()),R47<TODAY()-183),YEAR($Q47),\"\"))),\"\")","v":""},{"$f":"IFERROR(IF(_xlfn.CONCAT($A47:$AR47,TEXT($AS47,\"0;-0;;@\"),$AT47,TEXT($AU47,\"0;-0;;@\"),$AW47)=\"\",IF(AND(ROW(AY47)>2,OFFSET(AY47,1,0)<>\"\"),\"^\",\"\"),\"×\"),\"\")","v":""},{"$f":"IF($A47&$B47=\"\",\"\",OFFSET(AZ47,-1,0))","v":""},{"$f":"IFERROR(VLOOKUP($AZ47,'SLT-Leistungsklasse'!$A:$H,5,FALSE),IF($A47 & $B47 & $C47=\"\",\"\",OFFSET(BA47,-1,0)))","v":""},{"$f":"IFERROR(INDEX(OFFSET(ZH,0,-1),MATCH($BA47,ZH,0)),\"\")","v":""},{"$f":"IFERROR(IF(OR($BB47=\"\",$Q47 < DATE(2000,1,1)),\"\",$BB47 & \"·\" & YEAR($Q47)),\"\")","v":""},{"$f":"IF(OR($H47=0,$H47=3,$H47=4),$BC47,\"\")","v":""},{"$f":"IFERROR(VLOOKUP($AZ47,'SLT-Leistungsklasse'!A:B,2,FALSE),\"\")","v":""},{"$f":"IFERROR(IF(AND($BA47<>\"\",$AZ47<>\"\"),IFERROR(INDEX(OFFSET(ZH,0,-2),MATCH($BA47,ZH,0)),\"\"),\"\"),\"\")","v":""},"mxjy-hvy"]
[null,null,null,null,{"$f":"IFERROR(INDEX(OFFSET(Liste_Geschlecht,0,-1),MATCH($D48,Liste_Geschlecht,0)),\"\")","v":""},null,null,{"$f":"IFERROR(INDEX(OFFSET(Liste_Aufenthaltsstatus,0,-1),MATCH($G48,Liste_Aufenthaltsstatus,0)),\"\")","v":""},null,{"$f":"IFERROR(INDEX(OFFSET(Staaten,0,-1),MATCH($I48,Staaten,0)),\"\")","v":""},null,null,null,null,{"$f":"IFERROR(LEFT(N48,FIND(\" \",$N48)-1),\"\")","v":""},{"$f":"IFERROR(INDEX(Angebote!$J:$J,MATCH($O48,OFFSET(Liste_Angebote,0,1),0)+ROW(Liste_Angebote)-1),\"\")","v":""},null,null,null,null,null,null,null,null,null,null,null,null,null,null,null,null,null,null,null,null,null,null,null,null,null,null,null,null,0,null,0,{"$f":"IF(AND($AU48<>0,COUNTIF($AU$2:$AU48,\"<>0\")<>OFFSET(AV48,-1,0)),COUNTIF($AU$2:$AU48,\"<>0\"),\"\")","v":""},{"$f":"IF(AND(_xlfn.ISFORMULA($AS48),ISBLANK($AR48),NOT(ISBLANK($S48))),\"Noch nicht abgerechnet; Kosten gemäss Offerte\",\"\")","v":""},{"$f":"IFERROR(IF($Q48=\"\",\"\",IF(AND(YEAR($Q48)+IF(MONTH(TODAY())<4,1,0)<YEAR(TODAY()),$AR48<>\"\"),YEAR($Q48),IF(AND(YEAR($Q48)<YEAR(TODAY()),R48<TODAY()-183),YEAR($Q48),\"\"))),\"\")","v":""},{"$f":"IFERROR(IF(_xlfn.CONCAT($A48:$AR48,TEXT($AS48,\"0;-0;;@\"),$AT48,TEXT($AU48,\"0;-0;;@\"),$AW48)=\"\",IF(AND(ROW(AY48)>2,OFFSET(AY48,1,0)<>\"\"),\"^\",\"\"),\"×\"),\"\")","v":""},{"$f":"IF($A48&$B48=\"\",\"\",OFFSET(AZ48,-1,0))","v":""},{"$f":"IFERROR(VLOOKUP($AZ48,'SLT-Leistungsklasse'!$A:$H,5,FALSE),IF($A48 & $B48 & $C48=\"\",\"\",OFFSET(BA48,-1,0)))","v":""},{"$f":"IFERROR(INDEX(OFFSET(ZH,0,-1),MATCH($BA48,ZH,0)),\"\")","v":""},{"$f":"IFERROR(IF(OR($BB48=\"\",$Q48 < DATE(2000,1,1)),\"\",$BB48 & \"·\" & YEAR($Q48)),\"\")","v":""},{"$f":"IF(OR($H48=0,$H48=3,$H48=4),$BC48,\"\")","v":""},{"$f":"IFERROR(VLOOKUP($AZ48,'SLT-Leistungsklasse'!A:B,2,FALSE),\"\")","v":""},{"$f":"IFERROR(IF(AND($BA48<>\"\",$AZ48<>\"\"),IFERROR(INDEX(OFFSET(ZH,0,-2),MATCH($BA48,ZH,0)),\"\"),\"\"),\"\")","v":""},"n3jn-v79"]
[null,null,null,null,{"$f":"IFERROR(INDEX(OFFSET(Liste_Geschlecht,0,-1),MATCH($D49,Liste_Geschlecht,0)),\"\")","v":""},null,null,{"$f":"IFERROR(INDEX(OFFSET(Liste_Aufenthaltsstatus,0,-1),MATCH($G49,Liste_Aufenthaltsstatus,0)),\"\")","v":""},null,{"$f":"IFERROR(INDEX(OFFSET(Staaten,0,-1),MATCH($I49,Staaten,0)),\"\")","v":""},null,null,null,null,{"$f":"IFERROR(LEFT(N49,FIND(\" \",$N49)-1),\"\")","v":""},{"$f":"IFERROR(INDEX(Angebote!$J:$J,MATCH($O49,OFFSET(Liste_Angebote,0,1),0)+ROW(Liste_Angebote)-1),\"\")","v":""},null,null,null,null,null,null,null,null,null,null,null,null,null,null,null,null,null,null,null,null,null,null,null,null,null,null,null,null,0,null,0,{"$f":"IF(AND($AU49<>0,COUNTIF($AU$2:$AU49,\"<>0\")<>OFFSET(AV49,-1,0)),COUNTIF($AU$2:$AU49,\"<>0\"),\"\")","v":""},{"$f":"IF(AND(_xlfn.ISFORMULA($AS49),ISBLANK($AR49),NOT(ISBLANK($S49))),\"Noch nicht abgerechnet; Kosten gemäss Offerte\",\"\")","v":""},{"$f":"IFERROR(IF($Q49=\"\",\"\",IF(AND(YEAR($Q49)+IF(MONTH(TODAY())<4,1,0)<YEAR(TODAY()),$AR49<>\"\"),YEAR($Q49),IF(AND(YEAR($Q49)<YEAR(TODAY()),R49<TODAY()-183),YEAR($Q49),\"\"))),\"\")","v":""},{"$f":"IFERROR(IF(_xlfn.CONCAT($A49:$AR49,TEXT($AS49,\"0;-0;;@\"),$AT49,TEXT($AU49,\"0;-0;;@\"),$AW49)=\"\",IF(AND(ROW(AY49)>2,OFFSET(AY49,1,0)<>\"\"),\"^\",\"\"),\"×\"),\"\")","v":""},{"$f":"IF($A49&$B49=\"\",\"\",OFFSET(AZ49,-1,0))","v":""},{"$f":"IFERROR(VLOOKUP($AZ49,'SLT-Leistungsklasse'!$A:$H,5,FALSE),IF($A49 & $B49 & $C49=\"\",\"\",OFFSET(BA49,-1,0)))","v":""},{"$f":"IFERROR(INDEX(OFFSET(ZH,0,-1),MATCH($BA49,ZH,0)),\"\")","v":""},{"$f":"IFERROR(IF(OR($BB49=\"\",$Q49 < DATE(2000,1,1)),\"\",$BB49 & \"·\" & YEAR($Q49)),\"\")","v":""},{"$f":"IF(OR($H49=0,$H49=3,$H49=4),$BC49,\"\")","v":""},{"$f":"IFERROR(VLOOKUP($AZ49,'SLT-Leistungsklasse'!A:B,2,FALSE),\"\")","v":""},{"$f":"IFERROR(IF(AND($BA49<>\"\",$AZ49<>\"\"),IFERROR(INDEX(OFFSET(ZH,0,-2),MATCH($BA49,ZH,0)),\"\"),\"\"),\"\")","v":""},"rifj-5xj"]
[null,null,null,null,{"$f":"IFERROR(INDEX(OFFSET(Liste_Geschlecht,0,-1),MATCH($D50,Liste_Geschlecht,0)),\"\")","v":""},null,null,{"$f":"IFERROR(INDEX(OFFSET(Liste_Aufenthaltsstatus,0,-1),MATCH($G50,Liste_Aufenthaltsstatus,0)),\"\")","v":""},null,{"$f":"IFERROR(INDEX(OFFSET(Staaten,0,-1),MATCH($I50,Staaten,0)),\"\")","v":""},null,null,null,null,{"$f":"IFERROR(LEFT(N50,FIND(\" \",$N50)-1),\"\")","v":""},{"$f":"IFERROR(INDEX(Angebote!$J:$J,MATCH($O50,OFFSET(Liste_Angebote,0,1),0)+ROW(Liste_Angebote)-1),\"\")","v":""},null,null,null,null,null,null,null,null,null,null,null,null,null,null,null,null,null,null,null,null,null,null,null,null,null,null,null,null,0,null,0,{"$f":"IF(AND($AU50<>0,COUNTIF($AU$2:$AU50,\"<>0\")<>OFFSET(AV50,-1,0)),COUNTIF($AU$2:$AU50,\"<>0\"),\"\")","v":""},{"$f":"IF(AND(_xlfn.ISFORMULA($AS50),ISBLANK($AR50),NOT(ISBLANK($S50))),\"Noch nicht abgerechnet; Kosten gemäss Offerte\",\"\")","v":""},{"$f":"IFERROR(IF($Q50=\"\",\"\",IF(AND(YEAR($Q50)+IF(MONTH(TODAY())<4,1,0)<YEAR(TODAY()),$AR50<>\"\"),YEAR($Q50),IF(AND(YEAR($Q50)<YEAR(TODAY()),R50<TODAY()-183),YEAR($Q50),\"\"))),\"\")","v":""},{"$f":"IFERROR(IF(_xlfn.CONCAT($A50:$AR50,TEXT($AS50,\"0;-0;;@\"),$AT50,TEXT($AU50,\"0;-0;;@\"),$AW50)=\"\",IF(AND(ROW(AY50)>2,OFFSET(AY50,1,0)<>\"\"),\"^\",\"\"),\"×\"),\"\")","v":""},{"$f":"IF($A50&$B50=\"\",\"\",OFFSET(AZ50,-1,0))","v":""},{"$f":"IFERROR(VLOOKUP($AZ50,'SLT-Leistungsklasse'!$A:$H,5,FALSE),IF($A50 & $B50 & $C50=\"\",\"\",OFFSET(BA50,-1,0)))","v":""},{"$f":"IFERROR(INDEX(OFFSET(ZH,0,-1),MATCH($BA50,ZH,0)),\"\")","v":""},{"$f":"IFERROR(IF(OR($BB50=\"\",$Q50 < DATE(2000,1,1)),\"\",$BB50 & \"·\" & YEAR($Q50)),\"\")","v":""},{"$f":"IF(OR($H50=0,$H50=3,$H50=4),$BC50,\"\")","v":""},{"$f":"IFERROR(VLOOKUP($AZ50,'SLT-Leistungsklasse'!A:B,2,FALSE),\"\")","v":""},{"$f":"IFERROR(IF(AND($BA50<>\"\",$AZ50<>\"\"),IFERROR(INDEX(OFFSET(ZH,0,-2),MATCH($BA50,ZH,0)),\"\"),\"\"),\"\")","v":""},"ulu7-9z6"]
[null,null,null,null,{"$f":"IFERROR(INDEX(OFFSET(Liste_Geschlecht,0,-1),MATCH($D51,Liste_Geschlecht,0)),\"\")","v":""},null,null,{"$f":"IFERROR(INDEX(OFFSET(Liste_Aufenthaltsstatus,0,-1),MATCH($G51,Liste_Aufenthaltsstatus,0)),\"\")","v":""},null,{"$f":"IFERROR(INDEX(OFFSET(Staaten,0,-1),MATCH($I51,Staaten,0)),\"\")","v":""},null,null,null,null,{"$f":"IFERROR(LEFT(N51,FIND(\" \",$N51)-1),\"\")","v":""},{"$f":"IFERROR(INDEX(Angebote!$J:$J,MATCH($O51,OFFSET(Liste_Angebote,0,1),0)+ROW(Liste_Angebote)-1),\"\")","v":""},null,null,null,null,null,null,null,null,null,null,null,null,null,null,null,null,null,null,null,null,null,null,null,null,null,null,null,null,0,null,0,{"$f":"IF(AND($AU51<>0,COUNTIF($AU$2:$AU51,\"<>0\")<>OFFSET(AV51,-1,0)),COUNTIF($AU$2:$AU51,\"<>0\"),\"\")","v":""},{"$f":"IF(AND(_xlfn.ISFORMULA($AS51),ISBLANK($AR51),NOT(ISBLANK($S51))),\"Noch nicht abgerechnet; Kosten gemäss Offerte\",\"\")","v":""},{"$f":"IFERROR(IF($Q51=\"\",\"\",IF(AND(YEAR($Q51)+IF(MONTH(TODAY())<4,1,0)<YEAR(TODAY()),$AR51<>\"\"),YEAR($Q51),IF(AND(YEAR($Q51)<YEAR(TODAY()),R51<TODAY()-183),YEAR($Q51),\"\"))),\"\")","v":""},{"$f":"IFERROR(IF(_xlfn.CONCAT($A51:$AR51,TEXT($AS51,\"0;-0;;@\"),$AT51,TEXT($AU51,\"0;-0;;@\"),$AW51)=\"\",IF(AND(ROW(AY51)>2,OFFSET(AY51,1,0)<>\"\"),\"^\",\"\"),\"×\"),\"\")","v":""},{"$f":"IF($A51&$B51=\"\",\"\",OFFSET(AZ51,-1,0))","v":""},{"$f":"IFERROR(VLOOKUP($AZ51,'SLT-Leistungsklasse'!$A:$H,5,FALSE),IF($A51 & $B51 & $C51=\"\",\"\",OFFSET(BA51,-1,0)))","v":""},{"$f":"IFERROR(INDEX(OFFSET(ZH,0,-1),MATCH($BA51,ZH,0)),\"\")","v":""},{"$f":"IFERROR(IF(OR($BB51=\"\",$Q51 < DATE(2000,1,1)),\"\",$BB51 & \"·\" & YEAR($Q51)),\"\")","v":""},{"$f":"IF(OR($H51=0,$H51=3,$H51=4),$BC51,\"\")","v":""},{"$f":"IFERROR(VLOOKUP($AZ51,'SLT-Leistungsklasse'!A:B,2,FALSE),\"\")","v":""},{"$f":"IFERROR(IF(AND($BA51<>\"\",$AZ51<>\"\"),IFERROR(INDEX(OFFSET(ZH,0,-2),MATCH($BA51,ZH,0)),\"\"),\"\"),\"\")","v":""},"ed2x-bwx"]

{"sheet":"Anleitung Makros","index":2,"n_rows":7,"n_cols":2,"rows_kept":7,"cut":false,"hidden":true,"merged":[[1,1,1,2],[3,1,3,3],[4,1,4,3],[6,1,6,3],[9,1,9,3]]}
[]
[null,"Makros aktivieren!"]
[]
[null,"Die «Erhebungsvorlage 2022» verwendet Makros (und hat deshalb die Dateierweiterung .xlsm). Sie müssen Makros aktivieren, um zufriedenstellend mit der Erhebungsvorlage arbeiten zu können. Wenn Sie diese Meldung sehen, so werden die Makros auf diesem Computer nicht ausgeführt. \n\nSie können Makros wie folgt aktivieren:\n"]
[null,"● Falls Sie oben im Fenster einen gelben Balken sehen mit einer weissen Taste «Bearbeitung aktivieren» oder «Inhalt aktivieren», so drücken Sie diese Taste. Sie erlauben damit die Makros für diese Datei. \n    Die Makros werden dann automatisch gestartet, und die Meldung erscheint erst wieder, wenn Sie die Datei an einem anderen Ort abspeichern. "]
[]
[null,"● Falls Sie den untenstehenden Balken sehen, so klicken Sie auf «Trust Center» und öffnen Sie dort die «Einstellungen für das Trust-Center». Wählen Sie links «Makroeinstellungen» dann die Option\n    «Deaktivieren von VBA-Makros mit Benachrichtigung». Allenfalls müssen Sie die Einstellungen im Trust Center gemeinsam mit Ihrem Informatikverantwortlichen überarbeiten."]

{"sheet":"Aktualisierung","index":3,"n_rows":14,"n_cols":5,"rows_kept":14,"cut":false,"hidden":false,"merged":[]}
[]
[null,"Verwaltungsfunktionen",{"$f":"IF(recent_fileversion_check_ts<>\"\",\"Letzte Prüfung für neue Versionen\"&CHAR(10)&\"am \"&TEXT(recent_fileversion_check_ts,OFFSET(application_language,0,1)),\"\")","v":""}]
[]
[null,"Ablageort der jederzeit aktuellen Datei: "]
[null,"https://iazh.fi-ji-zh.ch/dl/erhebungsvorlage-iazh.xlsm",null,49,{"$f":"IF(application_language=1,\"d. mmmm yyyy hh:nn:ss\",\"T. MMMM JJJJ, HH:mm:ss\")","v":"T. MMMM JJJJ, HH:mm:ss"}]
[]
[1,"Angebote aktualisieren",{"$f":"INDEX(file_version_list,2)&\" vom \"&TEXT(INDEX(file_version_timestamps,2),\"T. MMMM JJJJ\")","v":" V036 vom 9. Januar 2023"}]
[null,"Klicken Sie auf die Taste rechts, um die Liste der Angebote (und alle anderen Wertelisten) zu aktualisieren.\nDie neuen Daten werden aus dem Internet geladen. "]
[2,"Erhebungsvorlage aktualisieren",{"$f":"INDEX(file_version_list,2)&\" vom \"&TEXT(INDEX(file_version_timestamps,2),\"T. MMMM JJJJ\")","v":" V036 vom 9. Januar 2023"}]
[null,"Klicken Sie auf die Taste rechts, um die Fälle dieser Datei in die aktuellste Version der Erhebungsvorlage zu übertragen, welche aus dem Internet herunter geladen wird. \n"]
[3,"Fälle importieren"]
[null,"Klicken Sie auf die Taste rechts, um die Daten aus einer anderen Erhebungsvorlage in diese Datei zu importieren.  "]
[4,"Formeln auf dem Blatt «Dateneingabe» zurücksetzen"]
[null,"Auf dem Arbeitsblatt «Dateneingabe» sind Formeln enthalten, welche benötigte Eingaben automatisieren, meist in versteckten Spalten. \nÜber die Tastenkombination Ctrl+R oder durch Klicken auf die Taste rechts können diese Formeln zurückgesetzt werden. Unter den Datenzeilen werden diese Formeln auf 50 leeren Zeilen vorbereitet. \nBeim Öffnen der Datei werden die Formeln ebenfalls zurückgesetzt. "]

{"sheet":"Optionen","index":4,"n_rows":298,"n_cols":9,"rows_kept":298,"cut":false,"hidden":true,"merged":[]}
["Politische_Gemeinde",null,"Aufenthaltsstatus",null,"Staatsangehörigkeit",null,"Geschlecht",null,"Spaltentitel"]
[21,"Adlikon",5,"Schutzbedürftige (S)",8571,"Abchasien",1,"Männlich","SLT-ID"]
[131,"Adliswil",1,"Asylsuchende (N)",8579,"Adscharien",2,"Weiblich","Politische_Gemeinde"]
[241,"Aesch (ZH)",2,"Vorläufig Aufgenommene (F)",8501,"Afghanistan",3,"Unbestimmt","Politische_Gemeinde_Code"]
[1,"Aeugst am Albis",3,"Vorläufig aufgenommene Flüchtlinge (F)",8359,"Ägypten","","","Abrechnung_Gemeinde_Jahr"]
[2,"Affoltern am Albis",4,"Anerkannte Flüchtlinge B",8274,"Alandinseln","","","SLT_ID"]
[211,"Altikon",0,"Flüchtlinge (status unbekannt)",8201,"Albanien","","","Name_Bezirk"]
[30,"Andelfingen","","",8270,"Alderney","","","row_id"]
[51,"Bachenbülach","","",8304,"Algerien","","","AHV-Nummer"]
[81,"Bachs","","",8621,"Amerikanisch-Samoa","","","Nachname"]
[111,"Bäretswil","","",8202,"Andorra","","","Vorname"]
[52,"Bassersdorf","","",8305,"Angola","","","Geschlecht"]
[297,"Bauma","","",8446,"Anguilla","","","Geschlecht_Code"]
[22,"Benken (ZH)","","",8701,"Antarktis","","","Geburtsdatum"]
[23,"Berg am Irchel","","",8442,"Antigua und Barbuda","","","Aufenthaltsstatus"]
[242,"Birmensdorf (ZH)","","",8301,"Äquatorialguinea","","","Aufenthaltsstatus_Code"]
[3,"Bonstetten","","",8401,"Argentinien","","","Staatsangehörigkeit"]
[82,"Boppelsen","","",8560,"Armenien","","","Staatsangehörigkeit_Code"]
[213,"Brütten","","",8482,"Aruba","","","Einreisedatum_in_CH"]
[112,"Bubikon","","",8374,"Ascension","","","Zuzugsdatum_in_Kanton"]
[24,"Buch am Irchel","","",8561,"Aserbaidschan","","","Dossiernummer"]
[83,"Buchs (ZH)","","",8302,"Äthiopien","","","Angebot"]
[53,"Bülach","","",8601,"Australien","","","Angebotsnummer"]
[25,"Dachsen","","",8384,"Azawad","","","Angebotstitel"]
[214,"Dägerlen","","",8237,"Azoren","","","Eintrittsdatum"]
[84,"Dällikon","","",8402,"Bahamas","","","Austrittsdatum"]
[85,"Dänikon","","",8502,"Bahrain","","","Angebot_CHF"]
[215,"Dättlikon","","",8546,"Bangladesch","","","TR1_Datum"]
[86,"Dielsdorf","","",8403,"Barbados","","","TR1_Betrag"]
[243,"Dietikon","","",8266,"Belarus","","","TR2_Datum"]
[54,"Dietlikon","","",8204,"Belgien","","","TR2_Betrag"]
[216,"Dinhard","","",8419,"Belize","","","TR3_Datum"]
[26,"Dorf","","",8309,"Benin","","","TR3_Betrag"]
[191,"Dübendorf","","",8404,"Bermuda","","","TR4_Datum"]
[113,"Dürnten","","",8503,"Bhutan","","","TR4_Betrag"]
[192,"Egg","","",8306,"Biafra","","","TR5_Datum"]
[55,"Eglisau","","",8405,"Bolivien","","","TR5_Betrag"]
[294,"Elgg","","",8486,"Bonaire, Saint Eustatius und Saba","","","TR6_Datum"]
[218,"Ellikon an der Thur","","",8252,"Bosnien und Herzegowina","","","TR6_Betrag"]
[219,"Elsau","","",8307,"Botsuana","","","TR7_Datum"]
[56,"Embrach","","",8702,"Bouvetinsel","","","TR7_Betrag"]
[151,"Erlenbach (ZH)","","",8406,"Brasilien","","","TR8_Datum"]
[193,"Fällanden","","",8371,"Britische Territorien im Indischen Ozean","","","TR8_Betrag"]
[172,"Fehraltorf","","",8504,"Brunei Darussalam","","","TR9_Datum"]
[27,"Feuerthalen","","",8205,"Bulgarien","","","TR9_Betrag"]
[114,"Fischenthal","","",8337,"Burkina Faso","","","TR10_Datum"]
[28,"Flaach","","",8308,"Burundi","","","TR10_Betrag"]
[29,"Flurlingen","","",8319,"Cabo Verde","","","TR11_Datum"]
[57,"Freienstein-Teufen","","",8407,"Chile","","","TR11_Betrag"]
[244,"Geroldswil","","",8508,"China","","","TR12_Datum"]
[58,"Glattfelden","","",8682,"Cookinseln","","","TR12_Betrag"]
[115,"Gossau (ZH)","","",8408,"Costa Rica","","","Abgeschlossen"]
[194,"Greifensee","","",8310,"Côte d'Ivoire","","","Kosten_CHF"]
[116,"Grüningen","","",8484,"Curaçao","","","Februar_Kosten_CHF"]
[220,"Hagenbuch","","",8578,"Dagestan","","","Rückzahlung_CHF"]
[4,"Hausen am Albis","","",8206,"Dänemark","","","Diff-ID"]
[5,"Hedingen","","",8208,"Deutsche Demokratische Republik","","","Ausblenden"]
[31,"Henggart","","",8207,"Deutschland","","","dirty"]
[152,"Herrliberg","","",8440,"Dominica","","","Bemerkungen_intern"]
[221,"Hettlingen","","",8409,"Dominikanische Republik","",""]
[117,"Hinwil","","",8303,"Dschibuti","",""]
[173,"Hittnau","","",8410,"Ecuador","",""]
[59,"Hochfelden","","",8411,"El Salvador","",""]
[153,"Hombrechtikon","","",8362,"Eritrea","",""]
[295,"Horgen","","",8260,"Estland","",""]
[60,"Höri","","",8352,"Eswatini","",""]
[32,"Humlikon","","",8412,"Falklandinseln","",""]
[61,"Hüntwangen","","",8210,"Färöer","",""]
[87,"Hüttikon","","",8602,"Fidschi","",""]
[296,"Illnau-Effretikon","","",8211,"Finnland","",""]
[6,"Kappel am Albis","","",8212,"Frankreich","",""]
[135,"Kilchberg (ZH)","","",8703,"Französische Süd- und Antarktisgebiete","",""]
[33,"Kleinandelfingen","","",8416,"Französisch-Guayana","",""]
[62,"Kloten","","",8548,"Französisch-Indochina","",""]
[7,"Knonau","","",8671,"Französisch-Polynesien","",""]
[154,"Küsnacht (ZH)","","",8311,"Gabun","",""]
[136,"Langnau am Albis","","",8312,"Gambia","",""]
[34,"Laufen-Uhwiesen","","",8562,"Georgien","",""]
[176,"Lindau","","",8313,"Ghana","",""]
[63,"Lufingen","","",8213,"Gibraltar","",""]
[155,"Männedorf","","",8441,"Grenada","",""]
[35,"Marthalen","","",8214,"Griechenland","",""]
[8,"Maschwanden","","",8413,"Grönland","",""]
[195,"Maur","","",8414,"Guadeloupe","",""]
[156,"Meilen","","",8632,"Guam","",""]
[9,"Mettmenstetten","","",8415,"Guatemala","",""]
[196,"Mönchaltorf","","",8272,"Guernsey","",""]
[88,"Neerach","","",8315,"Guinea","",""]
[223,"Neftenbach","","",8314,"Guinea-Bissau","",""]
[89,"Niederglatt","","",8417,"Guyana","",""]
[90,"Niederhasli","","",8418,"Haiti","",""]
[91,"Niederweningen","","",8447,"Hawaii","",""]
[64,"Nürensdorf","","",8653,"Heard und McDonaldinseln","",""]
[65,"Oberembrach","","",8420,"Honduras","",""]
[245,"Oberengstringen","","",8509,"Hongkong","",""]
[92,"Oberglatt","","",8510,"Indien","",""]
[137,"Oberrieden","","",8511,"Indonesien","",""]
[93,"Oberweningen","","",8576,"Inguschetien","",""]
[10,"Obfelden","","",8225,"Insel Man","",""]
[157,"Oetwil am See","","",8512,"Irak","",""]
[246,"Oetwil an der Limmat","","",8513,"Iran","",""]
[66,"Opfikon","","",8216,"Irland","",""]
[37,"Ossingen","","",8217,"Island","",""]
[94,"Otelfingen","","",8514,"Israel","",""]
[11,"Ottenbach","","",8218,"Italien","",""]
[177,"Pfäffikon","","",8421,"Jamaika","",""]
[224,"Pfungen","","",8515,"Japan","",""]
[67,"Rafz","","",8516,"Jemen","",""]
[95,"Regensberg","","",8271,"Jersey","",""]
[96,"Regensdorf","","",8633,"Johnstoninsel","",""]
[38,"Rheinau","","",8517,"Jordanien","",""]
[138,"Richterswil","","",8220,"Jugoslawien","",""]
[225,"Rickenbach (ZH)","","",8476,"Jungferninseln (UK)","",""]
[12,"Rifferswil","","",8472,"Jungferninseln (USA)","",""]
[68,"Rorbas","","",8573,"Kabardino-Balkarien","",""]
[97,"Rümlang","","",8473,"Kaimaninseln","",""]
[139,"Rüschlikon","","",8518,"Kambodscha","",""]
[178,"Russikon","","",8317,"Kamerun","",""]
[118,"Rüti (ZH)","","",8423,"Kanada","",""]
[226,"Schlatt (ZH)","","",8318,"Kanarische Inseln","",""]
[98,"Schleinikon","","",8572,"Karatschai-Tscherkessien","",""]
[247,"Schlieren","","",8563,"Kasachstan","",""]
[99,"Schöfflisdorf","","",8519,"Katar","",""]
[197,"Schwerzenbach","","",8320,"Kenia","",""]
[119,"Seegräben","","",8564,"Kirgisistan","",""]
[227,"Seuzach","","",8616,"Kiribati","",""]
[100,"Stadel","","",8637,"Kleinere amerikanische Überseeinseln","",""]
[158,"Stäfa","","",8652,"Kokosinseln","",""]
[13,"Stallikon","","",8424,"Kolumbien","",""]
[292,"Stammheim","","",8321,"Komoren","",""]
[101,"Steinmaur","","",8322,"Kongo (Brazzaville)","",""]
[39,"Thalheim an der Thur","","",8323,"Kongo (Kinshasa)","",""]
[141,"Thalwil","","",8530,"Korea (Nord-)","",""]
[40,"Trüllikon","","",8539,"Korea (Süd-)","",""]
[41,"Truttikon","","",8256,"Kosovo","",""]
[228,"Turbenthal","","",8250,"Kroatien","",""]
[159,"Uetikon am See","","",8425,"Kuba","",""]
[248,"Uitikon","","",8521,"Kuwait","",""]
[249,"Unterengstringen","","",8522,"Laos","",""]
[250,"Urdorf","","",8324,"Lesotho","",""]
[198,"Uster","","",8261,"Lettland","",""]
[43,"Volken","","",8523,"Libanon","",""]
[199,"Volketswil","","",8325,"Liberia","",""]
[293,"Wädenswil","","",8326,"Libyen","",""]
[120,"Wald (ZH)","","",8222,"Liechtenstein","",""]
[69,"Wallisellen","","",8262,"Litauen","",""]
[200,"Wangen-Brüttisellen","","",8223,"Luxemburg","",""]
[70,"Wasterkingen","","",8524,"Macao","",""]
[102,"Weiach","","",8327,"Madagaskar","",""]
[251,"Weiningen (ZH)","","",8328,"Madeira","",""]
[180,"Weisslingen","","",8329,"Malawi","",""]
[14,"Wettswil am Albis","","",8525,"Malaysia","",""]
[121,"Wetzikon (ZH)","","",8526,"Malediven","",""]
[298,"Wiesendangen","","",8330,"Mali","",""]
[71,"Wil (ZH)","","",8224,"Malta","",""]
[181,"Wila","","",8331,"Marokko","",""]
[182,"Wildberg","","",8617,"Marshallinseln","",""]
[72,"Winkel","","",8426,"Martinique","",""]
[230,"Winterthur","","",8332,"Mauretanien","",""]
[231,"Zell (ZH)","","",8333,"Mauritius","",""]
[161,"Zollikon","","",8361,"Mayotte","",""]
[160,"Zumikon","","",8427,"Mexiko","",""]
[261,"Zürich","","",8635,"Midwayinseln","",""]
[null,null,"","",8618,"Mikronesien","",""]
[null,null,"","",8263,"Moldova","",""]
[null,null,"","",8226,"Monaco","",""]
[null,null,"","",8528,"Mongolei","",""]
[null,null,"","",8254,"Montenegro","",""]
[null,null,"","",8475,"Montserrat","",""]
[null,null,"","",8334,"Mosambik","",""]
[null,null,"","",8505,"Myanmar","",""]
[null,null,"","",8351,"Namibia","",""]
[null,null,"","",8604,"Nauru","",""]
[null,null,"","",8529,"Nepal","",""]
[null,null,"","",8606,"Neukaledonien","",""]
[null,null,"","",8607,"Neuseeland","",""]
[null,null,"","",8429,"Nicaragua","",""]
[null,null,"","",8227,"Niederlande","",""]
[null,null,"","",8481,"Niederländische Antillen","",""]
[null,null,"","",8335,"Niger","",""]
[null,null,"","",8336,"Nigeria","",""]
[null,null,"","",8683,"Niue","",""]
[null,null,"","",8549,"Nordjemen","",""]
[null,null,"","",8630,"Nördliche Marianen","",""]
[null,null,"","",8255,"Nordmazedonien","",""]
[null,null,"","",8574,"Nordossetien-Alanien","",""]
[null,null,"","",8531,"Nordvietnam","",""]
[null,null,"","",8654,"Norfolkinsel","",""]
[null,null,"","",8228,"Norwegen","",""]
[null,null,"","",8527,"Oman","",""]
[null,null,"","",8229,"Österreich","",""]
[null,null,"","",8533,"Pakistan","",""]
[null,null,"","",8550,"Palästina","",""]
[null,null,"","",8619,"Palau","",""]
[null,null,"","",8430,"Panama","",""]
[null,null,"","",8608,"Papua-Neuguinea","",""]
[null,null,"","",8431,"Paraguay","",""]
[null,null,"","",8432,"Peru","",""]
[null,null,"","",8534,"Philippinen","",""]
[null,null,"","",8685,"Pitcairninseln","",""]
[null,null,"","",8230,"Polen","",""]
[null,null,"","",8231,"Portugal","",""]
[null,null,"","",8257,"Provinz Wojwodina","",""]
[null,null,"","",8433,"Puerto Rico","",""]
[null,null,"","",8339,"Reunion","",""]
[null,null,"","",8341,"Ruanda","",""]
[null,null,"","",8232,"Rumänien","",""]
[null,null,"","",8264,"Russland","",""]
[null,null,"","",8449,"Saint-Barthélemy","",""]
[null,null,"","",8448,"Saint-Martin (Frankreich)","",""]
[null,null,"","",8614,"Salomoninseln","",""]
[null,null,"","",8343,"Sambia","",""]
[null,null,"","",8612,"Samoa","",""]
[null,null,"","",8233,"San Marino","",""]
[null,null,"","",8383,"Sansibar","",""]
[null,null,"","",8344,"São Tomé und Príncipe","",""]
[null,null,"","",8552,"Sarawak","",""]
[null,null,"","",8275,"Sark","",""]
[null,null,"","",8535,"Saudi-Arabien","",""]
[null,null,"","",8234,"Schweden","",""]
[null,null,"","",8345,"Senegal","",""]
[null,null,"","",8248,"Serbien","",""]
[null,null,"","",8249,"Serbien und Montenegro","",""]
[null,null,"","",8346,"Seychellen","",""]
[null,null,"","",8347,"Sierra Leone","",""]
[null,null,"","",8536,"Sikkim","",""]
[null,null,"","",8340,"Simbabwe","",""]
[null,null,"","",8537,"Singapur","",""]
[null,null,"","",8485,"Sint Maarten (Niederlande)","",""]
[null,null,"","",8243,"Slowakei","",""]
[null,null,"","",8251,"Slowenien","",""]
[null,null,"","",8348,"Somalia","",""]
[null,null,"","",8236,"Spanien","",""]
[null,null,"","",8381,"Spanisch-Nordafrika","",""]
[null,null,"","",8506,"Sri Lanka","",""]
[null,null,"","",8373,"St. Helena","",""]
[null,null,"","",8445,"St. Kitts und Nevis","",""]
[null,null,"","",8443,"St. Lucia","",""]
[null,null,"","",8434,"St. Pierre und Miquelon","",""]
[null,null,"","",8444,"St. Vincent und die Grenadinen","",""]
[null,null,"","",8349,"Südafrika","",""]
[null,null,"","",8350,"Sudan","",""]
[null,null,"","",8483,"Südgeorgien und Südliche Sandwichinseln","",""]
[null,null,"","",8538,"Südjemen","",""]
[null,null,"","",8575,"Südossetien","",""]
[null,null,"","",8363,"Südsudan","",""]
[null,null,"","",8540,"Südvietnam","",""]
[null,null,"","",8435,"Suriname","",""]
[null,null,"","",8273,"Svalbard und Jan Mayen","",""]
[null,null,"","",8541,"Syrien","",""]
[null,null,"","",8565,"Tadschikistan","",""]
[null,null,"","",8507,"Taiwan (Chinesisches Taipei)","",""]
[null,null,"","",8382,"Tanganjika","",""]
[null,null,"","",8353,"Tansania","",""]
[null,null,"","",8542,"Thailand","",""]
[null,null,"","",8543,"Tibet","",""]
[null,null,"","",8544,"Timor (Portugal)","",""]
[null,null,"","",8547,"Timor-Leste","",""]
[null,null,"","",8354,"Togo","",""]
[null,null,"","",8684,"Tokelau","",""]
[null,null,"","",8610,"Tonga","",""]
[null,null,"","",8280,"Triest","",""]
[null,null,"","",8436,"Trinidad und Tobago","",""]
[null,null,"","",8375,"Tristan da Cunha","",""]
[null,null,"","",8356,"Tschad","",""]
[null,null,"","",8244,"Tschechien","",""]
[null,null,"","",8238,"Tschechoslowakei","",""]
[null,null,"","",8577,"Tschetschenien","",""]
[null,null,"","",8357,"Tunesien","",""]
[null,null,"","",8239,"Türkei","",""]
[null,null,"","",8566,"Turkmenistan","",""]
[null,null,"","",8474,"Turks- und Caicosinseln","",""]
[null,null,"","",8615,"Tuvalu","",""]
[null,null,"","",8358,"Uganda","",""]
[null,null,"","",8265,"Ukraine","",""]
[null,null,"","",8240,"Ungarn","",""]
[null,null,"","",8235,"Union der Sozialistischen Sowjetrepubliken","",""]
[null,null,"","",8437,"Uruguay","",""]
[null,null,"","",8567,"Usbekistan","",""]
[null,null,"","",8605,"Vanuatu","",""]
[null,null,"","",8241,"Vatikanstadt","",""]
[null,null,"","",8438,"Venezuela","",""]
[null,null,"","",8532,"Vereinigte Arabische Emirate","",""]
[null,null,"","",8551,"Vereinigte Arabische Republik","",""]
[null,null,"","",8439,"Vereinigte Staaten","",""]
[null,null,"","",8215,"Vereinigtes Königreich","",""]
[null,null,"","",8545,"Vietnam","",""]
[null,null,"","",8636,"Wakeinsel","",""]
[null,null,"","",8611,"Wallis und Futuna","",""]
[null,null,"","",8655,"Weihnachtsinsel","",""]
[null,null,"","",8209,"Westberlin","",""]
[null,null,"","",8372,"Westsahara","",""]
[null,null,"","",8360,"Zentralafrikanische Republik","",""]
[null,null,"","",8253,"Zentralserbien","",""]
[null,null,"","",8242,"Zypern","",""]
[null,null,"","",0,"Unbekannt","",""]
[null,null,"","",1,"Staatenlos","",""]
[null,null,"","",9,"Nicht angegeben","",""]

{"sheet":"Angebote","index":5,"n_rows":256,"n_cols":12,"rows_kept":256,"cut":false,"hidden":true,"merged":[]}
["Dropdown-Text","Angebotsnummer","Angebotsname","Anbietende Institution","Anbietende Institution","Status","Angebot_gültig_ab ","Angebot_gültig_bis","zuletzt_mutiert_am","=TEXTVERKETTEN(\" \";WAHR;C2;WENN(ISTLEER(D2);\"\";\"(\"&WECHSELN(D2;\"---\n- \";\"\")&\")\"))","Dropdown-Text 2021","Angebotsnummer"]
[{"$f":"B2&\" : \"&J2","v":"A-01-001 : Kompetenzerfassung (WTL Kompetenzerfassung)"},"A-01-001","Kompetenzerfassung","WTL Kompetenzerfassung","WTL Werk- und Technologiezentrum Linthgebiet","published","2021-01-01","2099-12-31","2022-09-19",{"$f":"_xlfn.TEXTJOIN(\" \",TRUE,C2,IF(ISBLANK(D2),\"\",\"(\"&SUBSTITUTE(D2,\"---\n- \",\"\")&\")\"))","v":"Kompetenzerfassung (WTL Kompetenzerfassung)"},"A-01-001 : WTL Kompetenzerfassung (WTL Werkund Technologiezentrum Linthgebiet)","A-01-001"]
[{"$f":"B3&\" : \"&J3","v":"A-01-002 : Kompetenzerfassung (Portal 44)"},"A-01-002","Kompetenzerfassung","Portal 44","Plattform Glattal","published","2021-01-01","2099-12-31","2020-12-21",{"$f":"_xlfn.TEXTJOIN(\" \",TRUE,C3,IF(ISBLANK(D3),\"\",\"(\"&SUBSTITUTE(D3,\"---\n- \",\"\")&\")\"))","v":"Kompetenzerfassung (Portal 44)"},"A-01-002 : Portal 44 (Plattform Glattal)","A-01-002"]
["A-01-003 : Kompetenzerfassung (HEKS MosaiQ Kompetenzabklärung)","A-01-003","Kompetenzerfassung","HEKS MosaiQ Kompetenzabklärung","HEKS Regionalstelle Zürich/Schaffhausen","published","2021-01-01","2099-12-31","2020-12-21","Kompetenzerfassung (HEKS MosaiQ Kompetenzabklärung)","A-01-003 : HEKS MosaiQ Kompetenzabklärung (HEKS Regionalstelle Zürich/Schaffhausen)","A-01-003"]
["A-01-005 : Kompetenzerfassung (AOZ Kompetenzerfassung)","A-01-005","Kompetenzerfassung","AOZ Kompetenzerfassung","Asyl-Organisation Zürich (AOZ)","published","2021-01-01","2099-12-31","2020-12-21","Kompetenzerfassung (AOZ Kompetenzerfassung)","A-01-005 : AOZ Kompetenzerfassung (Asyl-Organisation Zürich (AOZ))","A-01-005"]
["A-01-006 : Kompetenzerfassung (Kompetenzerfassung Stiftung Chance)","A-01-006","Kompetenzerfassung","Kompetenzerfassung Stiftung Chance","Stiftung Chance","published","2021-01-01","2099-12-31","2020-12-21","Kompetenzerfassung (Kompetenzerfassung Stiftung Chance)","A-01-006 : Kompetenzerfassung Stiftung Chance (Stiftung Chance)","A-01-006"]
["A-01-007 : Kompetenzerfassung (procomo Kompetenzerfassung)","A-01-007","Kompetenzerfassung","procomo Kompetenzerfassung","Förderverein cocomo","published","2021-01-01","2099-12-31","2020-12-21","Kompetenzerfassung (procomo Kompetenzerfassung)","A-01-007 : procomo Kompetenzerfassung (Förderverein cocomo)","A-01-007"]
["A-01-008 : Kompetenzerfassung (Prospectiva Eignungsabklärung)","A-01-008","Kompetenzerfassung","Prospectiva Eignungsabklärung","Soziale Unternehmungen Zürich SUZ","published","2021-01-01","2099-12-31","2020-12-21","Kompetenzerfassung (Prospectiva Eignungsabklärung)","A-01-008 : Prospectiva Eignungsabklärung (Soziale Unternehmungen Zürich SUZ)","A-01-008"]
["A-01-009 : Kompetenzerfassung (Kompetenzerfassung)","A-01-009","Kompetenzerfassung","Kompetenzerfassung","fokusarbeit AG","published","2021-01-01","2099-12-31","2020-12-21","Kompetenzerfassung (Kompetenzerfassung)","A-01-009 : Kompetenzerfassung (fokusarbeit AG)","A-01-009"]
["A-01-010 : Kompetenzerfassung (Kompetenzen-Check biz/LBZ)","A-01-010","Kompetenzerfassung","Kompetenzen-Check biz/LBZ","Amt für Jugend und Berufsberatung (biz) und Laufbahnzentrum der Stadt Zürich (LBZ)","published","2021-01-01","2099-12-31","2020-12-21","Kompetenzerfassung (Kompetenzen-Check biz/LBZ)","A-01-010 : Kompetenzen-Check biz/LBZ (Amt für Jugend und Berufsberatung (biz) und Laufbahnzentrum der Stadt Zürich (LBZ))","A-01-010"]
["A-01-011 : Kompetenzerfassung (FUTURI Standortbestimmung: Kompetenzen und Perspektiven klären)","A-01-011","Kompetenzerfassung","FUTURI Standortbestimmung: Kompetenzen und Perspektiven klären","Stiftung Futuri","published","2022-01-01","2099-12-31","2022-09-15","Kompetenzerfassung (FUTURI Standortbestimmung: Kompetenzen und Perspektiven klären)","A-01-011 : FUTURI STANDORTBESTIMMUNG:\nKompetenzen und Perspektiven klären (Stiftung Futuri)","A-01-011"]
["A-02-001 : Praxisassessment (WTL Praxisassessment)","A-02-001","Praxisassessment","WTL Praxisassessment","WTL Werk- und Technologiezentrum Linthgebiet","published","2021-01-01","2099-12-31","2022-09-19","Praxisassessment (WTL Praxisassessment)","A-02-001 : WTL Praxisassessment (WTL Werkund Technologiezentrum Linthgebiet)","A-02-001"]
["A-02-002 : Praxisassessment (Portal 44)","A-02-002","Praxisassessment","Portal 44","Plattform Glattal","published","2021-01-01","2099-12-31","2020-12-21","Praxisassessment (Portal 44)","A-02-002 : Portal 44 (Plattform Glattal)","A-02-002"]
["A-02-003 : Praxisassessment (Wegweiser)","A-02-003","Praxisassessment","Wegweiser","Zweckverband SNH","published","2021-01-01","2099-12-31","2020-12-21","Praxisassessment (Wegweiser)","A-02-003 : Wegweiser (Zweckverband SNH)","A-02-003"]
["A-02-004 : Praxisassessment (SAG.Praxisassessment)","A-02-004","Praxisassessment","SAG.Praxisassessment","Stiftung SAG","published","2021-01-01","2099-12-31","2022-09-15","Praxisassessment (SAG.Praxisassessment)","A-02-004 : SAG.Praxisassessment (Stiftung Arbeitsgestaltung SAG)","A-02-004"]
["A-02-005 : Praxisassessment (Praxisassessment)","A-02-005","Praxisassessment","Praxisassessment","Reissverschluss","published","2021-01-01","2099-12-31","2020-12-21","Praxisassessment (Praxisassessment)","A-02-005 : Praxisassessment (Reissverschluss)","A-02-005"]
["A-02-006 : Praxisassessment (Praxisassessment Kompass und KompassPlus)","A-02-006","Praxisassessment","Praxisassessment Kompass und KompassPlus","Stadt Winterthur – Arbeitsintegration Winterthur","published","2021-01-01","2099-12-31","2022-09-15","Praxisassessment (Praxisassessment Kompass und KompassPlus)","A-02-006 : Kompass, KompassPlus (Stadt Winterthur – Arbeitsintegration Winterthur)","A-02-006"]
["A-02-007 : Praxisassessment (AOZ Praxisassessment)","A-02-007","Praxisassessment","AOZ Praxisassessment","Asyl-Organisation Zürich (AOZ)","published","2021-01-01","2099-12-31","2020-12-21","Praxisassessment (AOZ Praxisassessment)","A-02-007 : AOZ Praxisassessment (Asyl-Organisation Zürich (AOZ))","A-02-007"]
["A-02-008 : Praxisassessment (procomo Praxisassessment)","A-02-008","Praxisassessment","procomo Praxisassessment","Förderverein cocomo","published","2021-01-01","2099-12-31","2020-12-21","Praxisassessment (procomo Praxisassessment)","A-02-008 : procomo Praxisassessment (Förderverein cocomo)","A-02-008"]
["A-02-009 : Praxisassessment (Praxisassessment)","A-02-009","Praxisassessment","Praxisassessment","fokusarbeit AG","published","2021-01-01","2099-12-31","2020-12-21","Praxisassessment (Praxisassessment)","A-02-009 : Praxisassessment (fokusarbeit AG)","A-02-009"]
["A-02-010 : Praxisassessment (Praxisassessment Stiftung Chance)","A-02-010","Praxisassessment","Praxisassessment Stiftung Chance","Stiftung Chance","published","2021-01-01","2099-12-31","2020-12-21","Praxisassessment (Praxisassessment Stiftung Chance)","A-02-010 : Praxisassessment Stiftung Chance (Stiftung Chance)","A-02-010"]
["AI-01-001 : Interne Arbeitseinsätze (WTL Interne Arbeitseinsätze)","AI-01-001","Interne Arbeitseinsätze","WTL Interne Arbeitseinsätze","WTL Werk- und Technologiezentrum Linthgebiet","published","2021-01-01","2099-12-31","2022-09-19","Interne Arbeitseinsätze (WTL Interne Arbeitseinsätze)"]
["AI-01-002 : Interne Arbeitseinsätze (Interne Arbeitseinsätze)","AI-01-002","Interne Arbeitseinsätze","Interne Arbeitseinsätze","Arche Zürich","published","2021-01-01","2099-12-31","2020-12-21","Interne Arbeitseinsätze (Interne Arbeitseinsätze)","AI-01-002 : Interne Arbeitseinsätze (Arche Zürich)","AI-01-002"]
["AI-01-003 : Interne Arbeitseinsätze (Arbeitsintegrationsprogramm Parklotsen)","AI-01-003","Interne Arbeitseinsätze","Arbeitsintegrationsprogramm Parklotsen","Plattform Glattal","published","2021-01-01","2099-12-31","2020-12-21","Interne Arbeitseinsätze (Arbeitsintegrationsprogramm Parklotsen)","AI-01-003 : Arbeitsintegrationsprogramm Parklotsen (Plattform Glattal)","AI-01-003"]
["AI-01-004 : Interne Arbeitseinsätze (Arbeitsintegrationsprogramm Pischte)","AI-01-004","Interne Arbeitseinsätze","Arbeitsintegrationsprogramm Pischte","Plattform Glattal","published","2021-01-01","2099-12-31","2020-12-21","Interne Arbeitseinsätze (Arbeitsintegrationsprogramm Pischte)","AI-01-004 : Arbeitsintegrationsprogramm Pischte (Plattform Glattal)","AI-01-004"]
["AI-01-005 : Interne Arbeitseinsätze (NOTA BENE Restaurant und Bäckerei)","AI-01-005","Interne Arbeitseinsätze","NOTA BENE Restaurant und Bäckerei","Plattform Glattal","published","2021-01-01","2099-12-31","2020-12-21","Interne Arbeitseinsätze (NOTA BENE Restaurant und Bäckerei)","AI-01-005 : NOTA BENE Restaurant und Bäckerei (Plattform Glattal)","AI-01-005"]
["AI-01-006 : Interne Arbeitseinsätze (Interne Arbeitseinsätze SNH)","AI-01-006","Interne Arbeitseinsätze","Interne Arbeitseinsätze SNH","Zweckverband SNH","published","2021-01-01","2099-12-31","2020-12-21","Interne Arbeitseinsätze (Interne Arbeitseinsätze SNH)","AI-01-006 : Interne Arbeitseinsätze SNH (Zweckverband SNH)","AI-01-006"]
["AI-01-007 : Interne Arbeitseinsätze (Interner Einsatz Arbeitsmarkt)","AI-01-007","Interne Arbeitseinsätze","Interner Einsatz Arbeitsmarkt","Stadt Winterthur – Arbeitsintegration Winterthur","published","2021-01-01","2099-12-31","2020-12-21","Interne Arbeitseinsätze (Interner Einsatz Arbeitsmarkt)","AI-01-007 : Interner Einsatz Arbeitsmarkt (Stadt Winterthur – Arbeitsintegration Winterthur)","AI-01-007"]
["AI-01-008 : Interne Arbeitseinsätze (TransFer - interner Einsatz Berufsbildung)","AI-01-008","Interne Arbeitseinsätze","TransFer - interner Einsatz Berufsbildung","Stadt Winterthur – Arbeitsintegration Winterthur","published","2021-01-01","2099-12-31","2020-12-21","Interne Arbeitseinsätze (TransFer - interner Einsatz Berufsbildung)","AI-01-008 : TransFer - interner Einsatz Berufsbildung (Stadt Winterthur – Arbeitsintegration Winterthur)","AI-01-008"]
["AI-01-009 : Interne Arbeitseinsätze (Gastro \"al gusto\")","AI-01-009","Interne Arbeitseinsätze","Gastro \"al gusto\"","Berufliche und Soziale Integrationsangebote Uster","published","2021-01-01","2099-12-31","2020-12-21","Interne Arbeitseinsätze (Gastro \"al gusto\")","AI-01-009 : Gastro \"al gusto\" (Berufliche und Soziale Integrationsangebote Uster)","AI-01-009"]
["AI-01-010 : Interne Arbeitseinsätze (\"Handwerk\")","AI-01-010","Interne Arbeitseinsätze","\"Handwerk\"","Berufliche und Soziale Integrationsangebote Uster","published","2021-01-01","2099-12-31","2020-12-21","Interne Arbeitseinsätze (\"Handwerk\")","AI-01-010 : \"Handwerk\" (Berufliche und Soziale Integrationsangebote Uster)","AI-01-010"]
["AI-01-011 : Interne Arbeitseinsätze (Praktikumseinsatz für Flüchtlinge und vorläufig Aufgenommene)","AI-01-011","Interne Arbeitseinsätze","Praktikumseinsatz für Flüchtlinge und vorläufig Aufgenommene","Stiftung Arbeitskette","published","2021-01-01","2099-12-31","2020-12-21","Interne Arbeitseinsätze (Praktikumseinsatz für Flüchtlinge und vorläufig Aufgenommene)","AI-01-011 : Praktikumseinsatz für Flüchtlinge und vorläufig Aufgenommene (Stiftung Arbeitskette)","AI-01-011"]
["AI-01-012 : Interne Arbeitseinsätze (Arbeitseinsatz intern VA/Flü)","AI-01-012","Interne Arbeitseinsätze","Arbeitseinsatz intern VA/Flü","Reissverschluss","published","2021-01-01","2099-12-31","2020-12-21","Interne Arbeitseinsätze (Arbeitseinsatz intern VA/Flü)","AI-01-012 : Arbeitseinsatz intern VA/Flü (Reissverschluss)","AI-01-012"]
["AI-01-013 : Interne Arbeitseinsätze ( job4you Arbeitstraining)","AI-01-013","Interne Arbeitseinsätze"," job4you Arbeitstraining","Stiftung work4you","published","2021-01-01","2099-12-31","2020-12-21","Interne Arbeitseinsätze ( job4you Arbeitstraining)","AI-01-013 :  job4you Arbeitstraining (Stiftung work4you)","AI-01-013"]
["AI-01-014 : Interne Arbeitseinsätze (AOZ Velostation Züri rollt)","AI-01-014","Interne Arbeitseinsätze","AOZ Velostation Züri rollt","Asyl-Organisation Zürich (AOZ)","published","2021-01-01","2099-12-31","2020-12-21","Interne Arbeitseinsätze (AOZ Velostation Züri rollt)","AI-01-014 : AOZ Velostation Züri rollt (Asyl-Organisation Zürich (AOZ))","AI-01-014"]
["AI-01-015 : Interne Arbeitseinsätze (AOZ Restaurant und Catering Paprika)","AI-01-015","Interne Arbeitseinsätze","AOZ Restaurant und Catering Paprika","Asyl-Organisation Zürich (AOZ)","published","2021-01-01","2099-12-31","2020-12-21","Interne Arbeitseinsätze (AOZ Restaurant und Catering Paprika)","AI-01-015 : AOZ Restaurant und Catering Paprika (Asyl-Organisation Zürich (AOZ))","AI-01-015"]
["AI-01-016 : Interne Arbeitseinsätze (AOZ Velowerkstatt Züri rollt)","AI-01-016","Interne Arbeitseinsätze","AOZ Velowerkstatt Züri rollt","Asyl-Organisation Zürich (AOZ)","published","2021-01-01","2099-12-31","2020-12-21","Interne Arbeitseinsätze (AOZ Velowerkstatt Züri rollt)","AI-01-016 : AOZ Velowerkstatt Züri rollt (Asyl-Organisation Zürich (AOZ))","AI-01-016"]
["AI-01-017 : Interne Arbeitseinsätze (AOZ Detailhandel und Transport Brockito)","AI-01-017","Interne Arbeitseinsätze","AOZ Detailhandel und Transport Brockito","Asyl-Organisation Zürich (AOZ)","published","2021-01-01","2099-12-31","2020-12-21","Interne Arbeitseinsätze (AOZ Detailhandel und Transport Brockito)","AI-01-017 : AOZ Detailhandel und Transport Brockito (Asyl-Organisation Zürich (AOZ))","AI-01-017"]
["AI-01-019 : Interne Arbeitseinsätze (AOZ Restaurant Riedbach)","AI-01-019","Interne Arbeitseinsätze","AOZ Restaurant Riedbach","Asyl-Organisation Zürich (AOZ)","published","2021-01-01","2099-12-31","2020-12-21","Interne Arbeitseinsätze (AOZ Restaurant Riedbach)","AI-01-018 : AOZ SBB Team Clean (Asyl-Organisation Zürich (AOZ))","AI-01-018"]
["AI-01-020 : Interne Arbeitseinsätze (Arbeitseinsätze intern Stiftung Chance)","AI-01-020","Interne Arbeitseinsätze","Arbeitseinsätze intern Stiftung Chance","Stiftung Chance","published","2021-01-01","2099-12-31","2020-12-21","Interne Arbeitseinsätze (Arbeitseinsätze intern Stiftung Chance)","AI-01-020 : Arbeitseinsätze intern Stiftung Chance (Stiftung Chance)","AI-01-020"]
["AI-01-021 : Interne Arbeitseinsätze (AOZ Restaurant Tasteria)","AI-01-021","Interne Arbeitseinsätze","AOZ Restaurant Tasteria","Asyl-Organisation Zürich (AOZ)","published","2021-01-01","2099-12-31","2020-12-21","Interne Arbeitseinsätze (AOZ Restaurant Tasteria)","AI-01-021 : AOZ Restaurant Tasteria (Asyl-Organisation Zürich (AOZ))","AI-01-021"]
["AI-01-022 : Interne Arbeitseinsätze (Smartworker )","AI-01-022","Interne Arbeitseinsätze","Smartworker ","Smartworker AG","published","2021-01-01","2099-12-31","2020-12-21","Interne Arbeitseinsätze (Smartworker )","AI-01-022 : Smartworker  (Smartworker AG)","AI-01-022"]
["AI-01-023 : Interne Arbeitseinsätze (Marktlücke - das Förderprogramm für Frauen)","AI-01-023","Interne Arbeitseinsätze","Marktlücke - das Förderprogramm für Frauen","Marktlücke GmbH","published","2021-01-01","2099-12-31","2020-12-21","Interne Arbeitseinsätze (Marktlücke - das Förderprogramm für Frauen)","AI-01-023 : Marktlücke - das Förderprogramm für Frauen (Marktlücke GmbH)","AI-01-023"]
["AI-01-024 : Interne Arbeitseinsätze (CucinaSaISAH)","AI-01-024","Interne Arbeitseinsätze","CucinaSaISAH","SAH Zürich","published","2021-01-01","2099-12-31","2020-12-21","Interne Arbeitseinsätze (CucinaSaISAH)","AI-01-024 : CucinaSaISAH (SAH Zürich)","AI-01-024"]
["AI-01-025 : Interne Arbeitseinsätze (Basismodul berufliche Integration)","AI-01-025","Interne Arbeitseinsätze","Basismodul berufliche Integration","Stiftung Ancora-Meilestei, berufliche Integration Wetzikon","published","2021-01-01","2099-12-31","2020-12-21","Interne Arbeitseinsätze (Basismodul berufliche Integration)","AI-01-025 : Basismodul berufliche Integration (Stiftung Ancora-Meilestei, berufliche Integration Wetzikon)","AI-01-025"]
["AI-01-026 : Interne Arbeitseinsätze (Praxisqualifizierung intern)","AI-01-026","Interne Arbeitseinsätze","Praxisqualifizierung intern","Stiftung Ancora-Meilestei, berufliche Integration Wetzikon","published","2021-01-01","2099-12-31","2020-12-21","Interne Arbeitseinsätze (Praxisqualifizierung intern)","AI-01-026 : Praxisqualifizierung intern (Stiftung Ancora-Meilestei, berufliche Integration Wetzikon)","AI-01-026"]
["AI-01-027 : Interne Arbeitseinsätze (Praxisqualifizierung für Personen mit Beeinträchtigung)","AI-01-027","Interne Arbeitseinsätze","Praxisqualifizierung für Personen mit Beeinträchtigung","Stiftung Ancora-Meilestei, berufliche Integration Wetzikon","published","2021-01-01","2099-12-31","2020-12-21","Interne Arbeitseinsätze (Praxisqualifizierung für Personen mit Beeinträchtigung)","AI-01-027 : Praxisqualifizierung für Personen mit Beeinträchtigung (Stiftung Ancora-Meilestei, berufliche Integration Wetzikon)","AI-01-027"]
["AI-01-028 : Interne Arbeitseinsätze (Klunkerei)","AI-01-028","Interne Arbeitseinsätze","Klunkerei","Plattform Glattal","published","2022-01-01","2099-12-31","2022-09-15","Interne Arbeitseinsätze (Klunkerei)","AI-01-028 : Arbeitsintegrationsprogramm Klunkerei (Verein Plattform Glattal)","AI-01-028"]
["AI-01-029 : Interne Arbeitseinsätze (Interne Arbeitseinsätze Freihof Küsnacht)","AI-01-029","Interne Arbeitseinsätze","Interne Arbeitseinsätze Freihof Küsnacht","Freihof Küsnacht","published","2022-01-01","2099-12-31","2021-12-06","Interne Arbeitseinsätze (Interne Arbeitseinsätze Freihof Küsnacht)","AI-01-029 : Interne Arbeitseinsätze Freihof Küsnacht (Freihof Küsnacht)","AI-01-029"]
["AI-01-030 : Interne Arbeitseinsätze (HEKS rollt plus)","AI-01-030","Interne Arbeitseinsätze","HEKS rollt plus","HEKS Regionalstelle Zürich/Schaffhausen","published","2022-01-01","2099-12-31","2022-09-19","Interne Arbeitseinsätze (HEKS rollt plus)","AI-01-030 : HEKS rollt plus (HEKS)","AI-01-030"]
["AI-01-031 : Interne Arbeitseinsätze (Läbesknospe & Restaurant Eulachstrand)","AI-01-031","Interne Arbeitseinsätze","Läbesknospe & Restaurant Eulachstrand","Läbesruum Winterthur","published","2022-01-01","2099-12-31","2022-09-19","Interne Arbeitseinsätze (Läbesknospe & Restaurant Eulachstrand)","AI-01-031 : Arbeitseinsätze - Restaurant Eulachstrand & Läbesknospe (Läbesruum)","AI-01-031"]
["AI-01-032 : Interne Arbeitseinsätze (Fachbereiche)","AI-01-032","Interne Arbeitseinsätze","Fachbereiche","Läbesruum Winterthur","published","2022-01-01","2099-12-31","2022-09-19","Interne Arbeitseinsätze (Fachbereiche)","AI-01-032 : Arbeitseinsätze - Fachbereiche (Läbesruum)","AI-01-032"]
["AI-02-001 : Externe Arbeitseinsätze (Integrationsprogramm \"possum\")","AI-02-001","Externe Arbeitseinsätze","Integrationsprogramm \"possum\"","Schweizerische Technische Fachschule Winterthur","published","2021-01-01","2099-12-31","2020-12-21","Externe Arbeitseinsätze (Integrationsprogramm \"possum\")","AI-02-001 : Integrationsprogramm \"possum\" (Schweizerische Technische Fachschule Winterthur)","AI-02-001"]
["AI-02-002 : Externe Arbeitseinsätze (WTL Externe Arbeitseinsätze)","AI-02-002","Externe Arbeitseinsätze","WTL Externe Arbeitseinsätze","WTL Werk- und Technologiezentrum Linthgebiet","published","2021-01-01","2099-12-31","2022-09-19","Externe Arbeitseinsätze (WTL Externe Arbeitseinsätze)","AI-02-002 : WTL Externe Arbeitseinsätze (WTL Werkund Technologiezentrum Linthgebiet)","AI-02-002"]
["AI-02-003 : Externe Arbeitseinsätze (Einzeleinsatzplätze)","AI-02-003","Externe Arbeitseinsätze","Einzeleinsatzplätze","Zweckverband SNH","published","2021-01-01","2099-12-31","2020-12-21","Externe Arbeitseinsätze (Einzeleinsatzplätze)","AI-02-003 : Einzeleinsatzplätze (Zweckverband SNH)","AI-02-003"]
["AI-02-004 : Externe Arbeitseinsätze (Externer Einsatz Arbeitsmarkt)","AI-02-004","Externe Arbeitseinsätze","Externer Einsatz Arbeitsmarkt","Stadt Winterthur – Arbeitsintegration Winterthur","published","2021-01-01","2099-12-31","2022-09-15","Externe Arbeitseinsätze (Externer Einsatz Arbeitsmarkt)","AI-02-004 : Externer Praxiseinsatz (Stadt Winterthur – Arbeitsintegration Winterthur)","AI-02-004"]
["AI-02-005 : Externe Arbeitseinsätze (TransFer - externer Einsatz Berufsbildung)","AI-02-005","Externe Arbeitseinsätze","TransFer - externer Einsatz Berufsbildung","Stadt Winterthur – Arbeitsintegration Winterthur","published","2021-01-01","2099-12-31","2020-12-21","Externe Arbeitseinsätze (TransFer - externer Einsatz Berufsbildung)","AI-02-005 : TransFer - externer Einsatz Berufsbildung (Stadt Winterthur – Arbeitsintegration Winterthur)","AI-02-005"]
["AI-02-006 : Externe Arbeitseinsätze (Arbeitseinsätze in externen Betrieben)","AI-02-006","Externe Arbeitseinsätze","Arbeitseinsätze in externen Betrieben","Berufliche und Soziale Integrationsangebote Uster","published","2021-01-01","2099-12-31","2020-12-21","Externe Arbeitseinsätze (Arbeitseinsätze in externen Betrieben)","AI-02-006 : Arbeitseinsätze in externen Betrieben (Berufliche und Soziale Integrationsangebote Uster)","AI-02-006"]
["AI-02-007 : Externe Arbeitseinsätze (HEKS-Visite steps)","AI-02-007","Externe Arbeitseinsätze","HEKS-Visite steps","HEKS Regionalstelle Zürich/Schaffhausen","published","2021-01-01","2099-12-31","2020-12-21","Externe Arbeitseinsätze (HEKS-Visite steps)","AI-02-007 : HEKS-Visite steps (HEKS Regionalstelle Zürich/Schaffhausen)","AI-02-007"]
["AI-02-008 : Externe Arbeitseinsätze (SAG.workguide+)","AI-02-008","Externe Arbeitseinsätze","SAG.workguide+","Stiftung SAG","published","2021-01-01","2099-12-31","2020-12-21","Externe Arbeitseinsätze (SAG.workguide+)","AI-02-008 : SAG.workguide+ (Stiftung SAG)","AI-02-008"]
["AI-02-009 : Externe Arbeitseinsätze (Integrationsangebot im ersten Arbeitsmarkt)","AI-02-009","Externe Arbeitseinsätze","Integrationsangebot im ersten Arbeitsmarkt","EsperLabor","published","2021-01-01","2099-12-31","2022-09-15","Externe Arbeitseinsätze (Integrationsangebot im ersten Arbeitsmarkt)","AI-02-009 : EsperLabor – Integrationsangebot im ersten Arbeitsmarkt (Stellennetz – Stiftung für Arbeitsintegration)","AI-02-009"]
["AI-02-010 : Externe Arbeitseinsätze (FUTURI Berufseinstieg: Einsatz/Anstellung im 1. Arbeitsmarkt)","AI-02-010","Externe Arbeitseinsätze","FUTURI Berufseinstieg: Einsatz/Anstellung im 1. Arbeitsmarkt","Stiftung Futuri","published","2021-01-01","2099-12-31","2020-12-21","Externe Arbeitseinsätze (FUTURI Berufseinstieg: Einsatz/Anstellung im 1. Arbeitsmarkt)","AI-02-010 : FUTURI Berufseinstieg: Einsatz/Anstellung im 1. Arbeitsmarkt (Stiftung Futuri)","AI-02-010"]
["AI-02-011 : Externe Arbeitseinsätze (AMIE F – Qualifizierungsprogramm für junge Flüchtlingsmütter)","AI-02-011","Externe Arbeitseinsätze","AMIE F – Qualifizierungsprogramm für junge Flüchtlingsmütter","SAH Zürich","published","2021-01-01","2099-12-31","2022-09-15","Externe Arbeitseinsätze (AMIE F – Qualifizierungsprogramm für junge Flüchtlingsmütter)","AI-02-011 : AMIE F (SAH Zürich)","AI-02-011"]
["AI-02-012 : Externe Arbeitseinsätze (ANSCHLUSS Arbeitseinsätze)","AI-02-012","Externe Arbeitseinsätze","ANSCHLUSS Arbeitseinsätze","SAH Zürich","published","2021-01-01","2099-12-31","2022-09-15","Externe Arbeitseinsätze (ANSCHLUSS Arbeitseinsätze)","AI-02-012 : ANSCHLUSS (SAH Zürich)","AI-02-012"]
["AI-02-013 : Externe Arbeitseinsätze (Arbeitseinsatz extern VA/Flü)","AI-02-013","Externe Arbeitseinsätze","Arbeitseinsatz extern VA/Flü","Reissverschluss","published","2021-01-01","2099-12-31","2020-12-21","Externe Arbeitseinsätze (Arbeitseinsatz extern VA/Flü)","AI-02-013 : Arbeitseinsatz extern VA/Flü (Reissverschluss)","AI-02-013"]
["AI-02-014 : Externe Arbeitseinsätze (AOZ GEP Berufliche Integration)","AI-02-014","Externe Arbeitseinsätze","AOZ GEP Berufliche Integration","Asyl-Organisation Zürich (AOZ)","published","2021-01-01","2099-12-31","2020-12-21","Externe Arbeitseinsätze (AOZ GEP Berufliche Integration)","AI-02-014 : AOZ GEP Berufliche Integration (Asyl-Organisation Zürich (AOZ))","AI-02-014"]
[{"$f":"B67&\" : \"&J67","v":"AI-02-015 : Externe Arbeitseinsätze (JobNavi Integration - externe Arbeitseinsätze)"},"AI-02-015","Externe Arbeitseinsätze","JobNavi Integration - externe Arbeitseinsätze","Ingeus AG","published","2021-01-01","2099-12-31","2020-12-21",{"$f":"_xlfn.TEXTJOIN(\" \",TRUE,C67,IF(ISBLANK(D67),\"\",\"(\"&SUBSTITUTE(D67,\"---\n- \",\"\")&\")\"))","v":"Externe Arbeitseinsätze (JobNavi Integration - externe Arbeitseinsätze)"},"AI-02-015 : JobNavi Integration - externe Arbeitseinsätze (Ingeus AG)","AI-02-015"]
["AI-02-016 : Externe Arbeitseinsätze (Arbeitseinsätze extern Stiftung Chance)","AI-02-016","Externe Arbeitseinsätze","Arbeitseinsätze extern Stiftung Chance","Stiftung Chance","published","2021-01-01","2099-12-31","2020-12-21","Externe Arbeitseinsätze (Arbeitseinsätze extern Stiftung Chance)","AI-02-016 : Arbeitseinsätze extern Stiftung Chance (Stiftung Chance)","AI-02-016"]
["AI-02-017 : Externe Arbeitseinsätze (jucomo)","AI-02-017","Externe Arbeitseinsätze","jucomo","Förderverein cocomo","published","2021-01-01","2099-12-31","2020-12-21","Externe Arbeitseinsätze (jucomo)","AI-02-017 : jucomo (Förderverein cocomo)","AI-02-017"]
["AI-02-018 : Externe Arbeitseinsätze (cocomo)","AI-02-018","Externe Arbeitseinsätze","cocomo","Förderverein cocomo","published","2021-01-01","2099-12-31","2020-12-21","Externe Arbeitseinsätze (cocomo)","AI-02-018 : cocomo (Förderverein cocomo)","AI-02-018"]
["AI-02-019 : Externe Arbeitseinsätze (Arbeitseinsätze in externen Betrieben)","AI-02-019","Externe Arbeitseinsätze","Arbeitseinsätze in externen Betrieben","fokusarbeit AG","published","2021-01-01","2099-12-31","2020-12-21","Externe Arbeitseinsätze (Arbeitseinsätze in externen Betrieben)","AI-02-019 : Arbeitseinsätze in externen Betrieben (fokusarbeit AG)","AI-02-019"]
["AI-02-020 : Externe Arbeitseinsätze (Prospectiva Arbeitseinsatz mit Begleitung)","AI-02-020","Externe Arbeitseinsätze","Prospectiva Arbeitseinsatz mit Begleitung","Soziale Unternehmungen Zürich SUZ","published","2021-01-01","2099-12-31","2020-12-21","Externe Arbeitseinsätze (Prospectiva Arbeitseinsatz mit Begleitung)","AI-02-020 : Prospectiva Arbeitseinsatz mit Begleitung (Soziale Unternehmungen Zürich SUZ)","AI-02-020"]
["AI-02-022 : Externe Arbeitseinsätze (Qualifizierender Einsatz im ersten Arbeitsmarkt)","AI-02-022","Externe Arbeitseinsätze","Qualifizierender Einsatz im ersten Arbeitsmarkt","Stiftung Ancora-Meilestei, berufliche Integration Wetzikon","published","2021-01-01","2099-12-31","2020-12-21","Externe Arbeitseinsätze (Qualifizierender Einsatz im ersten Arbeitsmarkt)","AI-02-022 : Qualifizierender Einsatz im ersten Arbeitsmarkt (Stiftung Ancora-Meilestei, berufliche Integration Wetzikon)","AI-02-022"]
["AI-02-023 : Externe Arbeitseinsätze (INTEGRO Qualifizierungsprogramm für TN mit sich manifestierenden psychischen Beeinträchtigungen)","AI-02-023","Externe Arbeitseinsätze","INTEGRO Qualifizierungsprogramm für TN mit sich manifestierenden psychischen Beeinträchtigungen","SAH Zürich","published","2021-01-01","2099-12-31","2020-12-21","Externe Arbeitseinsätze (INTEGRO Qualifizierungsprogramm für TN mit sich manifestierenden psychischen Beeinträchtigungen)","AI-02-023 : INTEGRO Qualifizierungsprogramm für TN mit sich manifestierenden psychischen Beeinträchtigungen (SAH Zürich)","AI-02-023"]
["AI-02-024 : Externe Arbeitseinsätze (INTEGRO Qualifizierungsprogramm für niedrig qualifizierte TN)","AI-02-024","Externe Arbeitseinsätze","INTEGRO Qualifizierungsprogramm für niedrig qualifizierte TN","SAH Zürich","published","2021-01-01","2099-12-31","2020-12-21","Externe Arbeitseinsätze (INTEGRO Qualifizierungsprogramm für niedrig qualifizierte TN)","AI-02-024 : INTEGRO Qualifizierungsprogramm für niedrig qualifizierte TN (SAH Zürich)","AI-02-024"]
["AI-02-025 : Externe Arbeitseinsätze (INTEGRO Qualifizierungsprogramm für gut- und hochqualifizierte TN)","AI-02-025","Externe Arbeitseinsätze","INTEGRO Qualifizierungsprogramm für gut- und hochqualifizierte TN","SAH Zürich","published","2021-01-01","2099-12-31","2020-12-21","Externe Arbeitseinsätze (INTEGRO Qualifizierungsprogramm für gut- und hochqualifizierte TN)","AI-02-025 : INTEGRO Qualifizierungsprogramm für gut- und hochqualifizierte TN (SAH Zürich)","AI-02-025"]
["AI-02-027 : Externe Arbeitseinsätze (Praxiseinsätze im 1. Arbeitsmarkt)","AI-02-027","Externe Arbeitseinsätze","Praxiseinsätze im 1. Arbeitsmarkt","Projekt Vitamin B – Radioschule klipp+klang","published","2022-01-01","2099-12-31","2022-09-15","Externe Arbeitseinsätze (Praxiseinsätze im 1. Arbeitsmarkt)","AI-02-027 : Projekt Vitamin B – Berufliche Integration für Geflüchtete (Projekt Vitamin B – Radioschule klipp+klang)","AI-02-027"]
["AI-02-029 : Externe Arbeitseinsätze (Arbeitseinsätze in externen Betrieben)","AI-02-029","Externe Arbeitseinsätze","Arbeitseinsätze in externen Betrieben","Läbesruum Winterthur","published","2022-01-01","2099-12-31","2022-09-19","Externe Arbeitseinsätze (Arbeitseinsätze in externen Betrieben)","AI-02-029 : Arbeitseinsätze in externen Betrieben (Läbesruum)","AI-02-029"]
["AI-02-030 : Externe Arbeitseinsätze (Impulsis Startbahn intensiv mit Praktikum und integrierter Bewerbungsunterstützung )","AI-02-030","Externe Arbeitseinsätze","Impulsis Startbahn intensiv mit Praktikum und integrierter Bewerbungsunterstützung ","Impulsis","published","2022-01-01","2099-12-31","2022-09-15","Externe Arbeitseinsätze (Impulsis Startbahn intensiv mit Praktikum und integrierter Bewerbungsunterstützung )","AI-02-030 : Startbahn intensiv mit Praktikum und integrierter Bewerbungsunterstützung (Impulsis)","AI-02-030"]
["AI-02-031 : Externe Arbeitseinsätze (Impulsis Startbahn basic mit Praktikum und integrierter Bewerbungsunterstützung )","AI-02-031","Externe Arbeitseinsätze","Impulsis Startbahn basic mit Praktikum und integrierter Bewerbungsunterstützung ","Impulsis","published","2022-01-01","2099-12-31","2022-09-15","Externe Arbeitseinsätze (Impulsis Startbahn basic mit Praktikum und integrierter Bewerbungsunterstützung )","AI-02-031 : Startbahn basic mit Praktikum und integrierter Bewerbungsunterstützung (Impulsis)","AI-02-031"]
["AI-02-032 : Externe Arbeitseinsätze (IPT Berufliche (Wieder-)Eingliederung  )","AI-02-032","Externe Arbeitseinsätze","IPT Berufliche (Wieder-)Eingliederung  ","Stiftung IPT","published","2022-01-01","2099-12-31","2022-09-15","Externe Arbeitseinsätze (IPT Berufliche (Wieder-)Eingliederung  )","AI-03-001 : Integrationsvorlehre RIESCO Gebäude- und Automobiltechnik (Hotel & Gastro formation Schweiz)","AI-02-032"]
["AI-03-002 : Branchenqualifizierung (Integrationsvorlehre RIESCO Bau)","AI-03-002","Branchenqualifizierung","Integrationsvorlehre RIESCO Bau","Hotel & Gastro formation Schweiz","published","2021-01-01","2099-12-31","2020-12-21","Branchenqualifizierung (Integrationsvorlehre RIESCO Bau)","AI-03-002 : Integrationsvorlehre RIESCO Bau (Hotel & Gastro formation Schweiz)","AI-03-002"]
["AI-03-003 : Branchenqualifizierung (Integrationsvorlehre RIESCO Gastronomie)","AI-03-003","Branchenqualifizierung","Integrationsvorlehre RIESCO Gastronomie","Hotel & Gastro formation Schweiz","published","2021-01-01","2099-12-31","2020-12-21","Branchenqualifizierung (Integrationsvorlehre RIESCO Gastronomie)"]
["AI-03-004 : Branchenqualifizierung (Gloria - Fachkurs für Unterhaltsreinigung)","AI-03-004","Branchenqualifizierung","Gloria - Fachkurs für Unterhaltsreinigung","Stellennetz – Stiftung für Arbeitsintegration","published","2021-01-01","2099-12-31","2020-12-21","Branchenqualifizierung (Gloria - Fachkurs für Unterhaltsreinigung)","AI-03-004 : Gloria - Fachkurs für Unterhaltsreinigung (Stellennetz – Stiftung für Arbeitsintegration)","AI-03-004"]
["AI-03-005 : Branchenqualifizierung (Grundkurs Lagerlogistik)","AI-03-005","Branchenqualifizierung","Grundkurs Lagerlogistik","Swiss Logistics Academy AG","published","2021-01-01","2099-12-31","2020-12-21","Branchenqualifizierung (Grundkurs Lagerlogistik)","AI-03-005 : Grundkurs Lagerlogistik (Swiss Logistics Academy AG)","AI-03-005"]
["AI-03-006 : Branchenqualifizierung (AOZ Gastrokurs)","AI-03-006","Branchenqualifizierung","AOZ Gastrokurs","Asyl-Organisation Zürich (AOZ)","published","2021-01-01","2099-12-31","2020-12-21","Branchenqualifizierung (AOZ Gastrokurs)","AI-03-006 : AOZ Gastrokurs (Asyl-Organisation Zürich (AOZ))","AI-03-006"]
["AI-03-007 : Branchenqualifizierung (Prospectiva Kurs und Praktikum Pflegehelfer/in SRK)","AI-03-007","Branchenqualifizierung","Prospectiva Kurs und Praktikum Pflegehelfer/in SRK","Soziale Unternehmungen Zürich SUZ","published","2021-01-01","2099-12-31","2020-12-21","Branchenqualifizierung (Prospectiva Kurs und Praktikum Pflegehelfer/in SRK)","AI-03-007 : Prospectiva Kurs und Praktikum Pflegehelfer/in SRK (Soziale Unternehmungen Zürich SUZ)","AI-03-007"]
["AI-03-008 : Branchenqualifizierung (AOZ Pflegekurs)","AI-03-008","Branchenqualifizierung","AOZ Pflegekurs","Asyl-Organisation Zürich (AOZ)","published","2021-01-01","2099-12-31","2020-12-21","Branchenqualifizierung (AOZ Pflegekurs)","AI-03-008 : AOZ Pflegekurs (Asyl-Organisation Zürich (AOZ))","AI-03-008"]
["AI-03-009 : Branchenqualifizierung (AOZ Reinigungskurs)","AI-03-009","Branchenqualifizierung","AOZ Reinigungskurs","Asyl-Organisation Zürich (AOZ)","published","2021-01-01","2099-12-31","2020-12-21","Branchenqualifizierung (AOZ Reinigungskurs)","AI-03-009 : AOZ Reinigungskurs (Asyl-Organisation Zürich (AOZ))","AI-03-009"]
["AI-04-001 : Jobcoaching (WTL Jobcoaching)","AI-04-001","Jobcoaching","WTL Jobcoaching","WTL Werk- und Technologiezentrum Linthgebiet","published","2021-01-01","2099-12-31","2022-09-19","Jobcoaching (WTL Jobcoaching)","AI-04-001 : WTL Jobcoaching (WTL Werkund Technologiezentrum Linthgebiet)","AI-04-001"]
["AI-04-002 : Jobcoaching (Job Coaching)","AI-04-002","Jobcoaching","Job Coaching","axisBildung","published","2021-01-01","2099-12-31","2020-12-21","Jobcoaching (Job Coaching)","AI-04-002 : Job Coaching (axisBildung)","AI-04-002"]
["AI-04-003 : Jobcoaching (Arbeitsintegrationscoaching)","AI-04-003","Jobcoaching","Arbeitsintegrationscoaching","Zweckverband SNH","published","2021-01-01","2099-12-31","2020-12-21","Jobcoaching (Arbeitsintegrationscoaching)","AI-04-003 : Arbeitsintegrationscoaching (Zweckverband SNH)","AI-04-003"]
["AI-04-004 : Jobcoaching (Jobcoaching)","AI-04-004","Jobcoaching","Jobcoaching","Stadt Winterthur – Arbeitsintegration Winterthur","published","2021-01-01","2099-12-31","2020-12-21","Jobcoaching (Jobcoaching)","AI-04-004 : Jobcoaching (Stadt Winterthur – Arbeitsintegration Winterthur)","AI-04-004"]
["AI-04-005 : Jobcoaching (TransFer - Jobcoaching Berufsbildung)","AI-04-005","Jobcoaching","TransFer - Jobcoaching Berufsbildung","Stadt Winterthur – Arbeitsintegration Winterthur","published","2021-01-01","2099-12-31","2020-12-21","Jobcoaching (TransFer - Jobcoaching Berufsbildung)","AI-04-005 : TransFer - Jobcoaching Berufsbildung (Stadt Winterthur – Arbeitsintegration Winterthur)","AI-04-005"]
["AI-04-006 : Jobcoaching (Arbeitsintegrationscoaching)","AI-04-006","Jobcoaching","Arbeitsintegrationscoaching","Berufliche und Soziale Integrationsangebote Uster","published","2021-01-01","2099-12-31","2020-12-21","Jobcoaching (Arbeitsintegrationscoaching)","AI-04-006 : Arbeitsintegrationscoaching (Berufliche und Soziale Integrationsangebote Uster)","AI-04-006"]
["AI-04-007 : Jobcoaching (HEKS MosaiQ Zürich Arbeitsintegrationscoaching)","AI-04-007","Jobcoaching","HEKS MosaiQ Zürich Arbeitsintegrationscoaching","HEKS Regionalstelle Zürich/Schaffhausen","published","2021-01-01","2099-12-31","2020-12-21","Jobcoaching (HEKS MosaiQ Zürich Arbeitsintegrationscoaching)","AI-04-007 : HEKS MosaiQ Zürich Arbeitsintegrationscoaching (HEKS Regionalstelle Zürich/Schaffhausen)","AI-04-007"]
["AI-04-008 : Jobcoaching (HEKS-Visite steps Begleitung)","AI-04-008","Jobcoaching","HEKS-Visite steps Begleitung","HEKS Regionalstelle Zürich/Schaffhausen","published","2021-01-01","2099-12-31","2020-12-21","Jobcoaching (HEKS-Visite steps Begleitung)","AI-04-008 : HEKS-Visite steps Begleitung (HEKS Regionalstelle Zürich/Schaffhausen)","AI-04-008"]
["AI-04-009 : Jobcoaching (SAG.workguide)","AI-04-009","Jobcoaching","SAG.workguide","Stiftung SAG","published","2021-01-01","2099-12-31","2020-12-21","Jobcoaching (SAG.workguide)","AI-04-009 : SAG.workguide (Stiftung SAG)","AI-04-009"]
["AI-04-010 : Jobcoaching (FUTURI Arbeitsintegrations-Coaching: Ausbildungsweg planen und umsetzen)","AI-04-010","Jobcoaching","FUTURI Arbeitsintegrations-Coaching: Ausbildungsweg planen und umsetzen","Stiftung Futuri","published","2021-01-01","2099-12-31","2022-09-15","Jobcoaching (FUTURI Arbeitsintegrations-Coaching: Ausbildungsweg planen und umsetzen)","AI-04-010 : FUTURI Arbeitsintegrations-Coaching: Ausbildung planen und vorbereiten (Stiftung Futuri)","AI-04-010"]
["AI-04-011 : Jobcoaching (AMIE F Job – Angebot für Flüchtlingsmütter)","AI-04-011","Jobcoaching","AMIE F Job – Angebot für Flüchtlingsmütter","SAH Zürich","published","2021-01-01","2099-12-31","2022-09-15","Jobcoaching (AMIE F Job – Angebot für Flüchtlingsmütter)","AI-04-011 : AMIE F Job (SAH Zürich)","AI-04-011"]
["AI-04-012 : Jobcoaching (ANSCHLUSS Jobcoaching)","AI-04-012","Jobcoaching","ANSCHLUSS Jobcoaching","SAH Zürich","published","2021-01-01","2099-12-31","2022-09-15","Jobcoaching (ANSCHLUSS Jobcoaching)","AI-04-012 : ANSCHLUSS (SAH Zürich)","AI-04-012"]
["AI-04-013 : Jobcoaching (Jobcoaching VA/Flü)","AI-04-013","Jobcoaching","Jobcoaching VA/Flü","Reissverschluss","published","2021-01-01","2099-12-31","2020-12-21","Jobcoaching (Jobcoaching VA/Flü)","AI-04-013 : Jobcoaching VA/Flü (Reissverschluss)","AI-04-013"]
["AI-04-014 : Jobcoaching ( chance4you Jobcoaching)","AI-04-014","Jobcoaching"," chance4you Jobcoaching","Stiftung work4you","published","2021-01-01","2099-12-31","2020-12-21","Jobcoaching ( chance4you Jobcoaching)","AI-04-014 :  chance4you Jobcoaching (Stiftung work4you)","AI-04-014"]
["AI-04-015 : Jobcoaching (JobNavi Integration - Jobcoaching)","AI-04-015","Jobcoaching","JobNavi Integration - Jobcoaching","Ingeus AG","published","2021-01-01","2099-12-31","2020-12-21","Jobcoaching (JobNavi Integration - Jobcoaching)","AI-04-015 : JobNavi Integration - Jobcoaching (Ingeus AG)","AI-04-015"]
["AI-04-016 : Jobcoaching (Arbeitsintegrationscoaching Stiftung Chance)","AI-04-016","Jobcoaching","Arbeitsintegrationscoaching Stiftung Chance","Stiftung Chance","published","2021-01-01","2099-12-31","2020-12-21","Jobcoaching (Arbeitsintegrationscoaching Stiftung Chance)","AI-04-016 : Arbeitsintegrationscoaching Stiftung Chance (Stiftung Chance)","AI-04-016"]
["AI-04-017 : Jobcoaching (cocomo)","AI-04-017","Jobcoaching","cocomo","Förderverein cocomo","published","2021-01-01","2099-12-31","2020-12-21","Jobcoaching (cocomo)","AI-04-017 : cocomo (Förderverein cocomo)","AI-04-017"]
["AI-04-018 : Jobcoaching (jucomo)","AI-04-018","Jobcoaching","jucomo","Förderverein cocomo","published","2021-01-01","2099-12-31","2020-12-21","Jobcoaching (jucomo)","AI-04-018 : jucomo (Förderverein cocomo)","AI-04-018"]
["AI-04-019 : Jobcoaching (Job-Coaching)","AI-04-019","Jobcoaching","Job-Coaching","fokusarbeit AG","published","2021-01-01","2099-12-31","2020-12-21","Jobcoaching (Job-Coaching)","AI-04-019 : Job-Coaching (fokusarbeit AG)","AI-04-019"]
["AI-04-020 : Jobcoaching (AOZ Arbeitsintegrationscoaching für Personen mit Arbeitsmarktpotenzial)","AI-04-020","Jobcoaching","AOZ Arbeitsintegrationscoaching für Personen mit Arbeitsmarktpotenzial","Asyl-Organisation Zürich (AOZ)","published","2021-01-01","2099-12-31","2020-12-21","Jobcoaching (AOZ Arbeitsintegrationscoaching für Personen mit Arbeitsmarktpotenzial)","AI-04-020 : AOZ Arbeitsintegrationscoaching für Personen mit Arbeitsmarktpotenzial (Asyl-Organisation Zürich (AOZ))","AI-04-020"]
["AI-04-021 : Jobcoaching (AOZ Arbeitsintegrationscoaching für gut- oder hochqualifizierte Personen)","AI-04-021","Jobcoaching","AOZ Arbeitsintegrationscoaching für gut- oder hochqualifizierte Personen","Asyl-Organisation Zürich (AOZ)","published","2021-01-01","2099-12-31","2020-12-21","Jobcoaching (AOZ Arbeitsintegrationscoaching für gut- oder hochqualifizierte Personen)","AI-04-021 : AOZ Arbeitsintegrationscoaching für gut- oder hochqualifizierte Personen (Asyl-Organisation Zürich (AOZ))","AI-04-021"]
["AI-04-022 : Jobcoaching (AOZ Arbeitsintegrationscoaching für Personen mit Ausbildungspotenzial)","AI-04-022","Jobcoaching","AOZ Arbeitsintegrationscoaching für Personen mit Ausbildungspotenzial","Asyl-Organisation Zürich (AOZ)","published","2021-01-01","2099-12-31","2020-12-21","Jobcoaching (AOZ Arbeitsintegrationscoaching für Personen mit Ausbildungspotenzial)","AI-04-022 : AOZ Arbeitsintegrationscoaching für Personen mit Ausbildungspotenzial (Asyl-Organisation Zürich (AOZ))","AI-04-022"]
["AI-04-023 : Jobcoaching (AOZ Arbeitsintegrationscoaching für Personen mit sich manifestierenden psychischen Belastungen)","AI-04-023","Jobcoaching","AOZ Arbeitsintegrationscoaching für Personen mit sich manifestierenden psychischen Belastungen","Asyl-Organisation Zürich (AOZ)","published","2021-01-01","2099-12-31","2020-12-21","Jobcoaching (AOZ Arbeitsintegrationscoaching für Personen mit sich manifestierenden psychischen Belastungen)","AI-04-023 : AOZ Arbeitsintegrationscoaching für Personen mit sich manifestierenden psychischen Belastungen (Asyl-Organisation Zürich (AOZ))","AI-04-023"]
["AI-04-024 : Jobcoaching (Projekt Vitamin B)","AI-04-024","Jobcoaching","Projekt Vitamin B","Projekt Vitamin B – Radioschule klipp+klang","published","2021-01-01","2099-12-31","2022-09-15","Jobcoaching (Projekt Vitamin B)","AI-04-024 : Projekt Vitamin B – Jobcoaching (Projekt Vitamin B – Radioschule klipp+klang)","AI-04-024"]
["AI-04-025 : Jobcoaching (INTEGRO Arbeitsintegrationscoaching)","AI-04-025","Jobcoaching","INTEGRO Arbeitsintegrationscoaching","SAH Zürich","published","2021-01-01","2099-12-31","2020-12-21","Jobcoaching (INTEGRO Arbeitsintegrationscoaching)","AI-04-025 : INTEGRO Arbeitsintegrationscoaching (SAH Zürich)","AI-04-025"]
["AI-04-027 : Jobcoaching (SPW-Integrationscoaching)","AI-04-027","Jobcoaching","SPW-Integrationscoaching","Swiss ProWork AG","published","2021-01-01","2099-12-31","2020-12-21","Jobcoaching (SPW-Integrationscoaching)","AI-04-027 : SPW-Integrationscoaching (Swiss ProWork AG)","AI-04-027"]
["AI-04-028 : Jobcoaching (IPT Berufliche (Wieder-)Eingliederung  )","AI-04-028","Jobcoaching","IPT Berufliche (Wieder-)Eingliederung  ","Stiftung IPT","published","2022-01-01","2099-12-31","2022-09-15","Jobcoaching (IPT Berufliche (Wieder-)Eingliederung  )","AI-04-028 : IPT Berufliche (Wieder-)Eingliederung (Stiftung IPT)","AI-04-028"]
["AI-04-030 : Jobcoaching (Jobcoaching)","AI-04-030","Jobcoaching","Jobcoaching","Läbesruum Winterthur","published","2022-01-01","2099-12-31","2022-09-19","Jobcoaching (Jobcoaching)","AI-04-030 : Jobcoaching (Läbesruum)","AI-04-030"]
["AI-04-031 : Jobcoaching (Jobcoaching)","AI-04-031","Jobcoaching","Jobcoaching","EsperLabor","published","2022-01-01","2099-12-31","2022-09-15","Jobcoaching (Jobcoaching)","AI-04-031 : EsperLabor – Jobcoaching (Stellennetz – Stiftung für Arbeitsintegration)","AI-04-031"]
["AI-04-032 : Jobcoaching (Impulsis BECO Berufseinstiegscoaching )","AI-04-032","Jobcoaching","Impulsis BECO Berufseinstiegscoaching ","Impulsis","published","2022-01-01","2099-12-31","2022-09-15","Jobcoaching (Impulsis BECO Berufseinstiegscoaching )","AI-04-032 : BECO Berufseinstiegscoaching (Impulsis)","AI-04-032"]
["AI-04-033 : Jobcoaching (Job Coaching)","AI-04-033","Jobcoaching","Job Coaching","SAH Schaffhausen","published","2022-01-01","2099-12-31","2022-09-15","Jobcoaching (Job Coaching)","AI-04-033 : SAH Jobcoaching (SAH Schaffhausen)","AI-04-033"]
["B-01-001 : Vollschulische Bildungsangebote (AOZ Integration Intensiv)","B-01-001","Vollschulische Bildungsangebote","AOZ Integration Intensiv","Asyl-Organisation Zürich (AOZ)","published","2021-01-01","2099-12-31","2020-12-21","Vollschulische Bildungsangebote (AOZ Integration Intensiv)","B-01-001 : AOZ Integration Intensiv (Asyl-Organisation Zürich (AOZ))","B-01-001"]
["B-01-002 : Vollschulische Bildungsangebote (Auftakt - das vollschulische Bildungsangebot)","B-01-002","Vollschulische Bildungsangebote","Auftakt - das vollschulische Bildungsangebot","Academia Integration","published","2021-01-01","2099-12-31","2020-12-21","Vollschulische Bildungsangebote (Auftakt - das vollschulische Bildungsangebot)","B-01-002 : Auftakt - das vollschulische Bildungsangebot (Academia Integration)","B-01-002"]
["B-01-003 : Vollschulische Bildungsangebote (Vorkurs Deutsch)","B-01-003","Vollschulische Bildungsangebote","Vorkurs Deutsch","Tempus, Öffentliche Berufsvorbereitung Küsnacht","published","2021-01-01","2099-12-31","2020-12-21","Vollschulische Bildungsangebote (Vorkurs Deutsch)","B-01-003 : Vorkurs Deutsch (Tempus, Öffentliche Berufsvorbereitung Küsnacht)","B-01-003"]
["B-01-004 : Vollschulische Bildungsangebote (Vorkurs DeutschPLUS+)","B-01-004","Vollschulische Bildungsangebote","Vorkurs DeutschPLUS+","Berufswahlschule Bülach","published","2021-01-01","2099-12-31","2020-12-21","Vollschulische Bildungsangebote (Vorkurs DeutschPLUS+)","B-01-005 : Vorkurs Deutsch & Praxis (Stiftung WBK)","B-01-004"]
["B-01-005 : Vollschulische Bildungsangebote (Vorkurs Deutsch & Praxis)","B-01-005","Vollschulische Bildungsangebote","Vorkurs Deutsch & Praxis","Stiftung WBK (Weiterbildungskurse) Dübendorf","published","2021-01-01","2099-12-31","2022-09-15","Vollschulische Bildungsangebote (Vorkurs Deutsch & Praxis)","B-01-006 : Sprungbrett (Swiss ProWork AG)","B-01-005"]
["B-01-007 : Vollschulische Bildungsangebote (START! Berufsbildung)","B-01-007","Vollschulische Bildungsangebote","START! Berufsbildung","EB Zürich","published","2021-01-01","2099-12-31","2020-12-21","Vollschulische Bildungsangebote (START! Berufsbildung)","B-01-007 : START! Berufsbildung (EB Zürich)","B-01-007"]
["B-01-008 : Vollschulische Bildungsangebote (Integration durch Bildung und Kultur (IBK))","B-01-008","Vollschulische Bildungsangebote","Integration durch Bildung und Kultur (IBK)","Welcome to School","published","2021-07-01","2099-12-31","2021-06-22","Vollschulische Bildungsangebote (Integration durch Bildung und Kultur (IBK))","B-01-008 : Integration durch Bildung und Kultur (IBK) (Welcome to School)","B-01-008"]
["B-01-009 : Vollschulische Bildungsangebote (Avanti!)","B-01-009","Vollschulische Bildungsangebote","Avanti!","Stiftung ECAP","published","2022-01-01","2099-12-31","2022-09-15","Vollschulische Bildungsangebote (Avanti!)"]
["B-01-010 : Vollschulische Bildungsangebote (Juma - Intensivkurs für Jugendliche und junge Erwachsene)","B-01-010","Vollschulische Bildungsangebote","Juma - Intensivkurs für Jugendliche und junge Erwachsene","SAH Schaffhausen","published","2022-01-01","2099-12-31","2022-09-15","Vollschulische Bildungsangebote (Juma - Intensivkurs für Jugendliche und junge Erwachsene)","B-01-010 : Juma (SAH Schaffhausen)","B-01-010"]
["B-01-011 : Vollschulische Bildungsangebote (Vorkurs Integration plus+)","B-01-011","Vollschulische Bildungsangebote","Vorkurs Integration plus+","Profil.Berufsvorbereitung Winterthur","published","2022-01-01","2099-12-31","2021-12-06","Vollschulische Bildungsangebote (Vorkurs Integration plus+)","B-01-011 : Vorkurs Integration plus+ (Profil.Berufsvorbereitung Winterthur)","B-01-011"]
[{"$f":"B131&\" : \"&J131","v":"B-01-012 : Vollschulische Bildungsangebote (START! Studium - Integrationsvorkurs an der UZH)"},"B-01-012","Vollschulische Bildungsangebote","START! Studium - Integrationsvorkurs an der UZH","Universität Zürich","published","2022-01-01","2099-12-31","2022-09-15",{"$f":"_xlfn.TEXTJOIN(\" \",TRUE,C131,IF(ISBLANK(D131),\"\",\"(\"&SUBSTITUTE(D131,\"---\n- \",\"\")&\")\"))","v":"Vollschulische Bildungsangebote (START! Studium - Integrationsvorkurs an der UZH)"},"B-01-012 : START! Studium (Universität Zürich UZH)","B-01-012"]
["B-02-001 : Bildungsmodule (Bildungsmodule go! plus 18)","B-02-001","Bildungsmodule","Bildungsmodule go! plus 18","Zweckverband SNH","published","2021-01-01","2099-12-31","2020-12-21","Bildungsmodule (Bildungsmodule go! plus 18)","B-02-001 : Bildungsmodule go! plus 18 (Zweckverband SNH)","B-02-001"]
["B-02-002 : Bildungsmodule (VkB Sprungbrett (Vorbereitungskurs für die Berufsschule - «Sprungbrett»))","B-02-002","Bildungsmodule","VkB Sprungbrett (Vorbereitungskurs für die Berufsschule - «Sprungbrett»)","IBBK Institut für Bildung Beratung und Kommunikation","published","2021-01-01","2099-12-31","2020-12-21","Bildungsmodule (VkB Sprungbrett (Vorbereitungskurs für die Berufsschule - «Sprungbrett»))",null,"B-02-002"]
["B-02-005 : Bildungsmodule (Bildungsmodul IKT)","B-02-005","Bildungsmodule","Bildungsmodul IKT","Academia Integration","published","2021-01-01","2099-12-31","2020-12-21","Bildungsmodule (Bildungsmodul IKT)","B-02-005 : Bildungsmodul IKT (Academia Integration)"]
["B-02-006 : Bildungsmodule (MIKT+)","B-02-006","Bildungsmodule","MIKT+","Academia Integration","published","2021-01-01","2099-12-31","2020-12-21","Bildungsmodule (MIKT+)","B-02-006 : MIKT+ (Academia Integration)","B-02-006"]
["B-02-007 : Bildungsmodule (Bildungsmodul Mathematik)","B-02-007","Bildungsmodule","Bildungsmodul Mathematik","Academia Integration","published","2021-01-01","2099-12-31","2020-12-21","Bildungsmodule (Bildungsmodul Mathematik)"]
["B-02-008 : Bildungsmodule (Praxisjahr)","B-02-008","Bildungsmodule","Praxisjahr","Förderverein cocomo","published","2021-01-01","2099-12-31","2020-12-21","Bildungsmodule (Praxisjahr)"]
["B-02-009 : Bildungsmodule (Module)","B-02-009","Bildungsmodule","Module","Förderverein cocomo","published","2021-01-01","2099-12-31","2020-12-21","Bildungsmodule (Module)","B-02-009 : Module (Förderverein cocomo)","B-02-009"]
["B-02-012 : Bildungsmodule (Mathematik Module)","B-02-012","Bildungsmodule","Mathematik Module","HEI Integration AG","published","2022-01-01","2099-12-31","2022-09-15","Bildungsmodule (Mathematik Module)","B-02-012 : Mathematik Module (HEI Integration)","B-02-012"]
["B-02-013 : Bildungsmodule (IKT Basiswissen - Vertiefung - Fortgeschritten)","B-02-013","Bildungsmodule","IKT Basiswissen - Vertiefung - Fortgeschritten","HEI Integration AG","published","2022-01-01","2099-12-31","2022-09-15","Bildungsmodule (IKT Basiswissen - Vertiefung - Fortgeschritten)","B-02-013 : IKT – Basiswissen – Vertiefung - Fortgeschritten (HEI Integration)","B-02-013"]
["B-02-014 : Bildungsmodule (IKT-Vorkurs)","B-02-014","Bildungsmodule","IKT-Vorkurs","HEI Integration AG","published","2022-01-01","2099-12-31","2022-09-15","Bildungsmodule (IKT-Vorkurs)","B-02-014 : IKT – Vorkurs (HEI Integration)","B-02-014"]
["B-02-015 : Bildungsmodule (Aus-Sprache und Auftritt)","B-02-015","Bildungsmodule","Aus-Sprache und Auftritt","HEI Integration AG","published","2022-01-01","2099-12-31","2022-09-15","Bildungsmodule (Aus-Sprache und Auftritt)"]
["B-02-018 : Bildungsmodule (Wege in die Arbeitswelt)","B-02-018","Bildungsmodule","Wege in die Arbeitswelt","HEI Integration AG","published","2022-01-01","2099-12-31","2022-09-15","Bildungsmodule (Wege in die Arbeitswelt)","B-02-018 : Wege in die Arbeitswelt (HEI Integration)","B-02-018"]
["B-02-019 : Bildungsmodule (AOZ telc-Prüfungsvorbereitung A2 / B1 / B2)","B-02-019","Bildungsmodule","AOZ telc-Prüfungsvorbereitung A2 / B1 / B2","Asyl-Organisation Zürich (AOZ)","published","2022-01-01","2099-12-31","2022-09-19","Bildungsmodule (AOZ telc-Prüfungsvorbereitung A2 / B1 / B2)","B-02-019 : AOZ telc-Prüfungsvorbereitung A2 / B1 / B2 (AOZ, Berufliche und soziale Integration)","B-02-019"]
["B-02-020 : Bildungsmodule (Informatikkurs)","B-02-020","Bildungsmodule","Informatikkurs","SAH Schaffhausen","published","2022-01-01","2099-12-31","2022-09-15","Bildungsmodule (Informatikkurs)",null,"B-02-020"]
["S-01-001 : Deutsch mit Ziel Arbeitsmarkt (WTL Deutsch mit Ziel Arbeitsmarkt intensiv)","S-01-001","Deutsch mit Ziel Arbeitsmarkt","WTL Deutsch mit Ziel Arbeitsmarkt intensiv","WTL Werk- und Technologiezentrum Linthgebiet","published","2021-01-01","2099-12-31","2022-09-19","Deutsch mit Ziel Arbeitsmarkt (WTL Deutsch mit Ziel Arbeitsmarkt intensiv)","S-01-001 : WTL Deutsch mit Ziel Arbeitsmarkt intensiv (WTL Werkund Technologiezentrum Linthgebiet)","S-01-001"]
["S-01-005 : Deutsch mit Ziel Arbeitsmarkt (AOZ Deutsch mit Ziel Arbeitsmarkt für Schulungewohnte intensiv A1-A2 (mit Kinderbetreuung))","S-01-005","Deutsch mit Ziel Arbeitsmarkt","AOZ Deutsch mit Ziel Arbeitsmarkt für Schulungewohnte intensiv A1-A2 (mit Kinderbetreuung)","Asyl-Organisation Zürich (AOZ)","published","2021-01-01","2099-12-31","2020-12-21","Deutsch mit Ziel Arbeitsmarkt (AOZ Deutsch mit Ziel Arbeitsmarkt für Schulungewohnte intensiv A1-A2 (mit Kinderbetreuung))","S-01-005 : AOZ Deutsch mit Ziel Arbeitsmarkt für Schulungewohnte intensiv A1-A2 (mit Kinderbetreuung) (Asyl-Organisation Zürich (AOZ))","S-01-005"]
["S-01-006 : Deutsch mit Ziel Arbeitsmarkt (AOZ Deutsch mit Ziel Arbeitsmarkt für schnell lernende Schulgewohnte intensiv A1-B2 (mit Kinderbetreuung))","S-01-006","Deutsch mit Ziel Arbeitsmarkt","AOZ Deutsch mit Ziel Arbeitsmarkt für schnell lernende Schulgewohnte intensiv A1-B2 (mit Kinderbetreuung)","Asyl-Organisation Zürich (AOZ)","published","2021-01-01","2099-12-31","2020-12-21","Deutsch mit Ziel Arbeitsmarkt (AOZ Deutsch mit Ziel Arbeitsmarkt für schnell lernende Schulgewohnte intensiv A1-B2 (mit Kinderbetreuung))","S-01-006 : AOZ Deutsch mit Ziel Arbeitsmarkt für schnell lernende Schulgewohnte intensiv A1-B2 (mit Kinderbetreuung) (Asyl-Organisation Zürich (AOZ))","S-01-006"]
["S-01-007 : Deutsch mit Ziel Arbeitsmarkt (Deutsch intensiv)","S-01-007","Deutsch mit Ziel Arbeitsmarkt","Deutsch intensiv","Stiftung ECAP","published","2021-01-01","2099-12-31","2020-12-21","Deutsch mit Ziel Arbeitsmarkt (Deutsch intensiv)","S-01-007 : Deutsch intensiv (Stiftung ECAP)","S-01-007"]
["S-01-008 : Deutsch mit Ziel Arbeitsmarkt (Fit für den Arbeitsmarkt semi-intensiv A1 bis B1)","S-01-008","Deutsch mit Ziel Arbeitsmarkt","Fit für den Arbeitsmarkt semi-intensiv A1 bis B1","Academia Integration","published","2021-01-01","2099-12-31","2022-09-15","Deutsch mit Ziel Arbeitsmarkt (Fit für den Arbeitsmarkt semi-intensiv A1 bis B1)","S-01-008 : Fit für den Arbeitsmarkt semi-intensiv A2 bis B1 (Academia Integration)","S-01-008"]
["S-01-009 : Deutsch mit Ziel Arbeitsmarkt (Fit für den Arbeitsmarkt - kompakt B1)","S-01-009","Deutsch mit Ziel Arbeitsmarkt","Fit für den Arbeitsmarkt - kompakt B1","Academia Integration","published","2021-01-01","2099-12-31","2020-12-21","Deutsch mit Ziel Arbeitsmarkt (Fit für den Arbeitsmarkt - kompakt B1)"]
["S-01-010 : Deutsch mit Ziel Arbeitsmarkt (Deutsch intensiv mit Kinderbetreuung)","S-01-010","Deutsch mit Ziel Arbeitsmarkt","Deutsch intensiv mit Kinderbetreuung","Stiftung ECAP","published","2021-01-01","2099-12-31","2020-12-21","Deutsch mit Ziel Arbeitsmarkt (Deutsch intensiv mit Kinderbetreuung)","S-01-010 : Deutsch intensiv mit Kinderbetreuung (Stiftung ECAP)","S-01-010"]
["S-01-011 : Deutsch mit Ziel Arbeitsmarkt (Deutsch- und Orientierungskurs (DuO))","S-01-011","Deutsch mit Ziel Arbeitsmarkt","Deutsch- und Orientierungskurs (DuO)","Fachschule Viventa","published","2021-01-01","2099-12-31","2022-09-15","Deutsch mit Ziel Arbeitsmarkt (Deutsch- und Orientierungskurs (DuO))","S-01-011 : Integrationskurs Standard (Fachschule Viventa)","S-01-011"]
["S-01-012 : Deutsch mit Ziel Arbeitsmarkt (Fit für den Arbeitsmarkt - intensiv A1.1 bis A2.2)","S-01-012","Deutsch mit Ziel Arbeitsmarkt","Fit für den Arbeitsmarkt - intensiv A1.1 bis A2.2","Academia Integration","published","2021-01-01","2099-12-31","2020-12-21","Deutsch mit Ziel Arbeitsmarkt (Fit für den Arbeitsmarkt - intensiv A1.1 bis A2.2)","S-01-012 : Fit für den Arbeitsmarkt - intensiv A1.1 bis A2.2 (Academia Integration)","S-01-012"]
["S-01-013 : Deutsch mit Ziel Arbeitsmarkt (Fit für den Arbeitsmarkt - kompakt A1 bis A2)","S-01-013","Deutsch mit Ziel Arbeitsmarkt","Fit für den Arbeitsmarkt - kompakt A1 bis A2","Academia Integration","published","2021-01-01","2099-12-31","2020-12-21","Deutsch mit Ziel Arbeitsmarkt (Fit für den Arbeitsmarkt - kompakt A1 bis A2)","S-01-013 : Fit für den Arbeitsmarkt - kompakt A1 bis A2 (Academia Integration)","S-01-013"]
["S-01-014 : Deutsch mit Ziel Arbeitsmarkt (Fit für den Arbeitsmarkt - intensiv B1.1 bis B2.2)","S-01-014","Deutsch mit Ziel Arbeitsmarkt","Fit für den Arbeitsmarkt - intensiv B1.1 bis B2.2","Academia Integration","published","2021-01-01","2099-12-31","2022-09-15","Deutsch mit Ziel Arbeitsmarkt (Fit für den Arbeitsmarkt - intensiv B1.1 bis B2.2)","S-01-014 : Fit für den Arbeitsmarkt - intensiv B1.1 bis B1.2 (Academia Integration)","S-01-014"]
["S-01-015 : Deutsch mit Ziel Arbeitsmarkt (Basiskurs Deutsch und Integration für Neuzugezogene)","S-01-015","Deutsch mit Ziel Arbeitsmarkt","Basiskurs Deutsch und Integration für Neuzugezogene","Stiftung ECAP","published","2021-01-01","2099-12-31","2020-12-21","Deutsch mit Ziel Arbeitsmarkt (Basiskurs Deutsch und Integration für Neuzugezogene)","S-01-015 : Basiskurs Deutsch und Integration für Neuzugezogene (Stiftung ECAP)","S-01-015"]
["S-01-016 : Deutsch mit Ziel Arbeitsmarkt (SPRINT)","S-01-016","Deutsch mit Ziel Arbeitsmarkt","SPRINT","Förderverein cocomo","published","2021-01-01","2099-12-31","2020-12-21","Deutsch mit Ziel Arbeitsmarkt (SPRINT)","S-01-016 : SPRINT (Förderverein cocomo)","S-01-016"]
["S-01-017 : Deutsch mit Ziel Arbeitsmarkt (SPRINTensiv)","S-01-017","Deutsch mit Ziel Arbeitsmarkt","SPRINTensiv","Förderverein cocomo","published","2021-01-01","2099-12-31","2020-12-21","Deutsch mit Ziel Arbeitsmarkt (SPRINTensiv)","S-01-017 : SPRINTensiv (Förderverein cocomo)","S-01-017"]
["S-01-018 : Deutsch mit Ziel Arbeitsmarkt (Deutsch mit Ziel Arbeitsmarkt Intensivkurs für Schulgewohnte)","S-01-018","Deutsch mit Ziel Arbeitsmarkt","Deutsch mit Ziel Arbeitsmarkt Intensivkurs für Schulgewohnte","Flying Teachers","published","2021-01-01","2099-12-31","2020-12-21","Deutsch mit Ziel Arbeitsmarkt (Deutsch mit Ziel Arbeitsmarkt Intensivkurs für Schulgewohnte)","S-01-018 : Deutsch mit Ziel Arbeitsmarkt Intensivkurs für Schulgewohnte (Flying Teachers)","S-01-018"]
["S-01-019 : Deutsch mit Ziel Arbeitsmarkt (Deutsch mit Ziel Arbeitsmarkt Intensivkurs für Schulungewohnte)","S-01-019","Deutsch mit Ziel Arbeitsmarkt","Deutsch mit Ziel Arbeitsmarkt Intensivkurs für Schulungewohnte","Flying Teachers","published","2021-01-01","2099-12-31","2020-12-21","Deutsch mit Ziel Arbeitsmarkt (Deutsch mit Ziel Arbeitsmarkt Intensivkurs für Schulungewohnte)","S-01-019 : Deutsch mit Ziel Arbeitsmarkt Intensivkurs für Schulungewohnte (Flying Teachers)","S-01-019"]
["S-01-020 : Deutsch mit Ziel Arbeitsmarkt (Deutsch mit Ziel Arbeitsmarkt Semi-Intensivkurs)","S-01-020","Deutsch mit Ziel Arbeitsmarkt","Deutsch mit Ziel Arbeitsmarkt Semi-Intensivkurs","Flying Teachers","published","2021-01-01","2099-12-31","2020-12-21","Deutsch mit Ziel Arbeitsmarkt (Deutsch mit Ziel Arbeitsmarkt Semi-Intensivkurs)","S-01-020 : Deutsch mit Ziel Arbeitsmarkt Semi-Intensivkurs (Flying Teachers)","S-01-020"]
["S-01-021 : Deutsch mit Ziel Arbeitsmarkt (AOZ Deutsch mit Ziel Arbeitsmarkt für normal lernende Schulgewohnte intensiv A1-B2 (mit Kinderbetreuung))","S-01-021","Deutsch mit Ziel Arbeitsmarkt","AOZ Deutsch mit Ziel Arbeitsmarkt für normal lernende Schulgewohnte intensiv A1-B2 (mit Kinderbetreuung)","Asyl-Organisation Zürich (AOZ)","published","2021-01-01","2099-12-31","2020-12-21","Deutsch mit Ziel Arbeitsmarkt (AOZ Deutsch mit Ziel Arbeitsmarkt für normal lernende Schulgewohnte intensiv A1-B2 (mit Kinderbetreuung))","S-01-021 : AOZ Deutsch mit Ziel Arbeitsmarkt für normal lernende Schulgewohnte intensiv A1-B2 (mit Kinderbetreuung) (Asyl-Organisation Zürich (AOZ))","S-01-021"]
["S-01-022 : Deutsch mit Ziel Arbeitsmarkt (AOZ Deutsch mit Ziel Arbeitsmarkt für normal lernende Schulgewohnte semi-intensiv A1-B2 (mit Kinderbetreuung))","S-01-022","Deutsch mit Ziel Arbeitsmarkt","AOZ Deutsch mit Ziel Arbeitsmarkt für normal lernende Schulgewohnte semi-intensiv A1-B2 (mit Kinderbetreuung)","Asyl-Organisation Zürich (AOZ)","published","2021-01-01","2099-12-31","2020-12-21","Deutsch mit Ziel Arbeitsmarkt (AOZ Deutsch mit Ziel Arbeitsmarkt für normal lernende Schulgewohnte semi-intensiv A1-B2 (mit Kinderbetreuung))","S-01-022 : AOZ Deutsch mit Ziel Arbeitsmarkt für normal lernende Schulgewohnte semi-intensiv A1-B2 (mit Kinderbetreuung) (Asyl-Organisation Zürich (AOZ))","S-01-022"]
["S-01-023 : Deutsch mit Ziel Arbeitsmarkt (AOZ Deutsch mit Ziel Arbeitsmarkt für Schulungewohnte semi-intensiv A1-A2 (mit Kinderbetreuung))","S-01-023","Deutsch mit Ziel Arbeitsmarkt","AOZ Deutsch mit Ziel Arbeitsmarkt für Schulungewohnte semi-intensiv A1-A2 (mit Kinderbetreuung)","Asyl-Organisation Zürich (AOZ)","published","2021-01-01","2099-12-31","2020-12-21","Deutsch mit Ziel Arbeitsmarkt (AOZ Deutsch mit Ziel Arbeitsmarkt für Schulungewohnte semi-intensiv A1-A2 (mit Kinderbetreuung))","S-01-023 : AOZ Deutsch mit Ziel Arbeitsmarkt für Schulungewohnte semi-intensiv A1-A2 (mit Kinderbetreuung) (Asyl-Organisation Zürich (AOZ))","S-01-023"]
["S-01-024 : Deutsch mit Ziel Arbeitsmarkt (Integration PLUS - Intensiv)","S-01-024","Deutsch mit Ziel Arbeitsmarkt","Integration PLUS - Intensiv","HEI Integration AG","published","2021-07-01","2099-12-31","2021-06-22","Deutsch mit Ziel Arbeitsmarkt (Integration PLUS - Intensiv)","S-01-024 : Integration PLUS - Intensiv (HEI Integration AG)","S-01-024"]
["S-01-025 : Deutsch mit Ziel Arbeitsmarkt (Integration PLUS - Semi-intensiv)","S-01-025","Deutsch mit Ziel Arbeitsmarkt","Integration PLUS - Semi-intensiv","HEI Integration AG","published","2021-07-01","2099-12-31","2021-06-22","Deutsch mit Ziel Arbeitsmarkt (Integration PLUS - Semi-intensiv)","S-01-025 : Integration PLUS - Semi-intensiv (HEI Integration AG)","S-01-025"]
["S-01-026 : Deutsch mit Ziel Arbeitsmarkt (Basiskurs Deutsch und Integration mit Kinderbetreuung)","S-01-026","Deutsch mit Ziel Arbeitsmarkt","Basiskurs Deutsch und Integration mit Kinderbetreuung","Stiftung ECAP","published","2021-01-01","2099-12-31","2020-12-21","Deutsch mit Ziel Arbeitsmarkt (Basiskurs Deutsch und Integration mit Kinderbetreuung)","S-01-026 : Basiskurs Deutsch und Integration mit Kinderbetreuung (Stiftung ECAP)","S-01-026"]
["S-01-027 : Deutsch mit Ziel Arbeitsmarkt (Deutsch Niveau A1 bis B2 - Intensiv)","S-01-027","Deutsch mit Ziel Arbeitsmarkt","Deutsch Niveau A1 bis B2 - Intensiv","Klubschule Migros Ostschweiz","published","2022-01-01","2099-12-31","2021-12-06","Deutsch mit Ziel Arbeitsmarkt (Deutsch Niveau A1 bis B2 - Intensiv)","S-01-027 : Deutsch Niveau A1 bis B2 - Intensiv (Klubschule Migros Ostschweiz)","S-01-027"]
["S-01-029 : Deutsch mit Ziel Arbeitsmarkt (Deutsch Plus Niveau A1 bis B1 - Intensiv)","S-01-029","Deutsch mit Ziel Arbeitsmarkt","Deutsch Plus Niveau A1 bis B1 - Intensiv","Klubschule Migros Ostschweiz","published","2022-01-01","2099-12-31","2021-12-06","Deutsch mit Ziel Arbeitsmarkt (Deutsch Plus Niveau A1 bis B1 - Intensiv)","S-01-029 : Deutsch Plus Niveau A1 bis B1 - Intensiv (Klubschule Migros Ostschweiz)","S-01-029"]
["S-01-031 : Deutsch mit Ziel Arbeitsmarkt (Deutsch: In der Schweiz leben und arbeiten (A1.1, A1.2, A2.1, A2.2))","S-01-031","Deutsch mit Ziel Arbeitsmarkt","Deutsch: In der Schweiz leben und arbeiten (A1.1, A1.2, A2.1, A2.2)","Stiftung WBK (Weiterbildungskurse) Dübendorf","published","2022-01-01","2099-12-31","2022-09-15","Deutsch mit Ziel Arbeitsmarkt (Deutsch: In der Schweiz leben und arbeiten (A1.1, A1.2, A2.1, A2.2))","S-01-031 : Deutsch A1: in der Schweiz leben und arbeiten (Stiftung WBK (Weiterbildungskurse) Dübendorf)","S-01-031"]
["S-01-034 : Deutsch mit Ziel Arbeitsmarkt (AOZ Deutsch mit Ziel Arbeitsmarkt Festigungskurse intensiv A1/A2 (mit Kinderbetreuung))","S-01-034","Deutsch mit Ziel Arbeitsmarkt","AOZ Deutsch mit Ziel Arbeitsmarkt Festigungskurse intensiv A1/A2 (mit Kinderbetreuung)","Asyl-Organisation Zürich (AOZ)","published","2022-01-01","2099-12-31","2022-09-19","Deutsch mit Ziel Arbeitsmarkt (AOZ Deutsch mit Ziel Arbeitsmarkt Festigungskurse intensiv A1/A2 (mit Kinderbetreuung))","S-01-034 : AOZ Deutsch mit Ziel Arbeitsmarkt Festigungskurse intensiv A1/A2 (mit Kinderbetreuung) (AOZ, Berufliche und soziale Integration)","S-01-034"]
["S-01-035 : Deutsch mit Ziel Arbeitsmarkt (Fit für den Arbeitsmarkt - Basiskommunikation A1)","S-01-035","Deutsch mit Ziel Arbeitsmarkt","Fit für den Arbeitsmarkt - Basiskommunikation A1","Academia Integration","published","2022-01-01","2099-12-31","2022-09-15","Deutsch mit Ziel Arbeitsmarkt (Fit für den Arbeitsmarkt - Basiskommunikation A1)","S-01-035 : Fit für den Arbeitsmarkt - Basiskommunikation (Academia Integration)","S-01-035"]
["S-01-036 : Deutsch mit Ziel Arbeitsmarkt (Deutsch mit Ziel Arbeitsmarkt)","S-01-036","Deutsch mit Ziel Arbeitsmarkt","Deutsch mit Ziel Arbeitsmarkt","Bénédict Berufsfachschule AG Zürich","published","2022-01-01","2099-12-31","2022-09-15","Deutsch mit Ziel Arbeitsmarkt (Deutsch mit Ziel Arbeitsmarkt)","S-01-036 : Deutsch für den Arbeitsmarkt (Benedict-Schule Zürich)","S-01-036"]
["S-01-037 : Deutsch mit Ziel Arbeitsmarkt (Deutsch-Modulkurse für Frauen)","S-01-037","Deutsch mit Ziel Arbeitsmarkt","Deutsch-Modulkurse für Frauen","SAH Schaffhausen","published","2022-01-01","2099-12-31","2022-09-15","Deutsch mit Ziel Arbeitsmarkt (Deutsch-Modulkurse für Frauen)","S-01-037 : Modulkurse A1.1, A1.2, A2.1, A2.2 für Frauen (SAH Schaffhausen)","S-01-037"]
["S-01-038 : Deutsch mit Ziel Arbeitsmarkt (Deutsch Intensivkurs)","S-01-038","Deutsch mit Ziel Arbeitsmarkt","Deutsch Intensivkurs","SAH Schaffhausen","published","2022-01-01","2099-12-31","2022-09-15","Deutsch mit Ziel Arbeitsmarkt (Deutsch Intensivkurs)","S-01-038 : Intensivkurse A1, A2, B1 (SAH Schaffhausen)","S-01-038"]
["S-01-039 : Deutsch mit Ziel Arbeitsmarkt (Deutsch Niveau A1, Einstiegskurs Intensiv Teil 1-6 )","S-01-039","Deutsch mit Ziel Arbeitsmarkt","Deutsch Niveau A1, Einstiegskurs Intensiv Teil 1-6 ","Klubschule Migros Zürich","published","2022-01-01","2099-12-31","2022-09-15","Deutsch mit Ziel Arbeitsmarkt (Deutsch Niveau A1, Einstiegskurs Intensiv Teil 1-6 )","S-01-039 : Deutsch Niveau A1, Einstiegskurs N/F Intensiv (Teil 1-6) inkl. telc-Prüfungstraining (Klubschule Migros Zürich)","S-01-039"]
["S-01-040 : Deutsch mit Ziel Arbeitsmarkt (Deutsch Niveau A2, Förderkurs Intensiv Teil 1-5 )","S-01-040","Deutsch mit Ziel Arbeitsmarkt","Deutsch Niveau A2, Förderkurs Intensiv Teil 1-5 ","Klubschule Migros Zürich","published","2022-01-01","2099-12-31","2022-09-15","Deutsch mit Ziel Arbeitsmarkt (Deutsch Niveau A2, Förderkurs Intensiv Teil 1-5 )","S-01-040 : Deutsch Niveau A2, Förderkurs N/F Intensiv (Teil 1-5) inkl. telc-Prüfungstraining (Klubschule Migros Zürich)","S-01-040"]
["S-01-041 : Deutsch mit Ziel Arbeitsmarkt (Deutsch für den Arbeitsmarkt, intensiv, A1 - B1)","S-01-041","Deutsch mit Ziel Arbeitsmarkt","Deutsch für den Arbeitsmarkt, intensiv, A1 - B1","Klubschule Migros Zürich","published","2022-09-15","2099-12-31","2022-09-15","Deutsch mit Ziel Arbeitsmarkt (Deutsch für den Arbeitsmarkt, intensiv, A1 - B1)",null,"S-01-041"]
["S-01-044 : Deutsch mit Ziel Arbeitsmarkt (SprintPlus - Sprache und Integration A1-A2 für Schulgewohnte)","S-01-044","Deutsch mit Ziel Arbeitsmarkt","SprintPlus - Sprache und Integration A1-A2 für Schulgewohnte","Förderverein cocomo","published","2022-09-15","2099-12-31","2022-09-15","Deutsch mit Ziel Arbeitsmarkt (SprintPlus - Sprache und Integration A1-A2 für Schulgewohnte)",null,"S-01-044"]
["S-01-045 : Deutsch mit Ziel Arbeitsmarkt (Deutsch für die Arbeitswelt: Start A1)","S-01-045","Deutsch mit Ziel Arbeitsmarkt","Deutsch für die Arbeitswelt: Start A1","Stellennetz - Stiftung für Arbeitsintegration","published","2022-09-15","2099-12-31","2022-09-15","Deutsch mit Ziel Arbeitsmarkt (Deutsch für die Arbeitswelt: Start A1)",null,"S-01-045"]
["S-01-046 : Deutsch mit Ziel Arbeitsmarkt (Deutsch für die Arbeitswelt: Aufbau A2)","S-01-046","Deutsch mit Ziel Arbeitsmarkt","Deutsch für die Arbeitswelt: Aufbau A2","Stellennetz - Stiftung für Arbeitsintegration","published","2022-09-15","2099-12-31","2022-09-15","Deutsch mit Ziel Arbeitsmarkt (Deutsch für die Arbeitswelt: Aufbau A2)",null,"S-01-046"]
["S-01-047 : Deutsch mit Ziel Arbeitsmarkt (Deutsch für die Arbeitswelt: Berufssprachkurs B1)","S-01-047","Deutsch mit Ziel Arbeitsmarkt","Deutsch für die Arbeitswelt: Berufssprachkurs B1","Stellennetz - Stiftung für Arbeitsintegration","published","2022-09-15","2099-12-31","2022-09-15","Deutsch mit Ziel Arbeitsmarkt (Deutsch für die Arbeitswelt: Berufssprachkurs B1)",null,"S-01-047"]
["S-01-048 : Deutsch mit Ziel Arbeitsmarkt (Deutsch Niveau A1-B2 – Semi-Intensiv)","S-01-048","Deutsch mit Ziel Arbeitsmarkt","Deutsch Niveau A1-B2 – Semi-Intensiv","Klubschule Migros Ostschweiz","published","2022-09-15","2099-12-31","2022-09-15","Deutsch mit Ziel Arbeitsmarkt (Deutsch Niveau A1-B2 – Semi-Intensiv)",null,"S-01-048"]
["S-01-051 : Deutsch mit Ziel Arbeitsmarkt (Deutsch Arbeitsmarkt)","S-01-051","Deutsch mit Ziel Arbeitsmarkt","Deutsch Arbeitsmarkt","Zweckverband SNH","published","2022-09-15","2099-12-31","2022-09-15","Deutsch mit Ziel Arbeitsmarkt (Deutsch Arbeitsmarkt)",null,"S-01-051"]
["S-01-052 : Deutsch mit Ziel Arbeitsmarkt (WTL Deutsch mit Ziel Arbeitsmarkt intensiv für schnell Lernende)","S-01-052","Deutsch mit Ziel Arbeitsmarkt","WTL Deutsch mit Ziel Arbeitsmarkt intensiv für schnell Lernende","WTL Werk- und Technologiezentrum Linthgebiet","published","2022-09-15","2099-12-31","2022-09-15","Deutsch mit Ziel Arbeitsmarkt (WTL Deutsch mit Ziel Arbeitsmarkt intensiv für schnell Lernende)",null,"S-01-052"]
["S-01-055 : Deutsch mit Ziel Arbeitsmarkt (Modulare Deutsch Semi-Intensivkurse)","S-01-055","Deutsch mit Ziel Arbeitsmarkt","Modulare Deutsch Semi-Intensivkurse","Stiftung ECAP","published","2022-09-15","2099-12-31","2022-09-15","Deutsch mit Ziel Arbeitsmarkt (Modulare Deutsch Semi-Intensivkurse)",null,"S-01-055"]
["S-01-056 : Deutsch mit Ziel Arbeitsmarkt (Deutsch mit Ziel Arbeitsmarkt)","S-01-056","Deutsch mit Ziel Arbeitsmarkt","Deutsch mit Ziel Arbeitsmarkt","SAL Schule für Angewandte Linguistik","published","2022-09-15","2099-12-31","2022-09-15","Deutsch mit Ziel Arbeitsmarkt (Deutsch mit Ziel Arbeitsmarkt)",null,"S-01-056"]
["S-01-060 : Deutsch mit Ziel Arbeitsmarkt (Deutsch für Integration Niveau A1 bis B2)","S-01-060","Deutsch mit Ziel Arbeitsmarkt","Deutsch für Integration Niveau A1 bis B2","Italk Sprachschule","published","2022-09-15","2099-12-31","2022-09-15","Deutsch mit Ziel Arbeitsmarkt (Deutsch für Integration Niveau A1 bis B2)",null,"S-01-060"]
["S-01-061 : Deutsch mit Ziel Arbeitsmarkt (Deutsch für Integration Niveau A1 bis B2)","S-01-061","Deutsch mit Ziel Arbeitsmarkt","Deutsch für Integration Niveau A1 bis B2","Italk Sprachschule","published","2022-09-15","2099-12-31","2022-09-15","Deutsch mit Ziel Arbeitsmarkt (Deutsch für Integration Niveau A1 bis B2)",null,"S-01-061"]
["S-01-062 : Deutsch mit Ziel Arbeitsmarkt (Deutsch Arbeitsmarkt )","S-01-062","Deutsch mit Ziel Arbeitsmarkt","Deutsch Arbeitsmarkt ","Zweckverband SNH","published","2022-09-15","2099-12-31","2022-09-15","Deutsch mit Ziel Arbeitsmarkt (Deutsch Arbeitsmarkt )",null,"S-01-062"]
["S-01-063 : Deutsch mit Ziel Arbeitsmarkt (Deutsch intensiv mit Kinderbetreuung)","S-01-063","Deutsch mit Ziel Arbeitsmarkt","Deutsch intensiv mit Kinderbetreuung","Stiftung ECAP","published","2023-01-01","2099-12-31","2022-12-20","Deutsch mit Ziel Arbeitsmarkt (Deutsch intensiv mit Kinderbetreuung)"]
["S-01-064 : Deutsch mit Ziel Arbeitsmarkt (Modulare Deutsch Semi-Intensivkurse)","S-01-064","Deutsch mit Ziel Arbeitsmarkt","Modulare Deutsch Semi-Intensivkurse","Stiftung ECAP","published","2023-01-01","2099-12-31","2022-12-20","Deutsch mit Ziel Arbeitsmarkt (Modulare Deutsch Semi-Intensivkurse)"]
["S-02-002 : Deutsch lokal (Gemeindekurse Deutsch mit Kinderbetreuung)","S-02-002","Deutsch lokal","Gemeindekurse Deutsch mit Kinderbetreuung","Akrotea.ch GmbH","published","2021-01-01","2099-12-31","2020-12-21","Deutsch lokal (Gemeindekurse Deutsch mit Kinderbetreuung)","S-02-002 : Gemeindekurse Deutsch mit Kinderbetreuung (Akrotea.ch GmbH)","S-02-002"]
[{"$f":"B195&\" : \"&J195","v":"S-02-003 : Deutsch lokal (Deutsch am Nachmittag / Deutsch am Abend und am Samstag)"},"S-02-003","Deutsch lokal","Deutsch am Nachmittag / Deutsch am Abend und am Samstag","Stiftung ECAP","published","2021-01-01","2099-12-31","2020-12-21",{"$f":"_xlfn.TEXTJOIN(\" \",TRUE,C195,IF(ISBLANK(D195),\"\",\"(\"&SUBSTITUTE(D195,\"---\n- \",\"\")&\")\"))","v":"Deutsch lokal (Deutsch am Nachmittag / Deutsch am Abend und am Samstag)"},"S-02-003 : Deutsch am Nachmittag / Deutsch am Abend und am Samstag (Stiftung ECAP)","S-02-003"]
["S-02-004 : Deutsch lokal (AOZ Deutsch lokal (mit Kinderbetreuung))","S-02-004","Deutsch lokal","AOZ Deutsch lokal (mit Kinderbetreuung)","Asyl-Organisation Zürich (AOZ)","published","2021-01-01","2099-12-31","2020-12-21","Deutsch lokal (AOZ Deutsch lokal (mit Kinderbetreuung))","S-02-004 : AOZ Deutsch lokal (mit Kinderbetreuung) (Asyl-Organisation Zürich (AOZ))","S-02-004"]
["S-02-005 : Deutsch lokal (Deutsch lokal)","S-02-005","Deutsch lokal","Deutsch lokal","HEI Integration AG","published","2021-01-01","2099-12-31","2020-12-21","Deutsch lokal (Deutsch lokal)","S-02-005 : Deutsch lokal (HEI Integration AG)","S-02-005"]
["S-02-006 : Deutsch lokal (Deutsch lokal für Schulgewohnte)","S-02-006","Deutsch lokal","Deutsch lokal für Schulgewohnte","Flying Teachers","published","2021-01-01","2099-12-31","2020-12-21","Deutsch lokal (Deutsch lokal für Schulgewohnte)","S-02-006 : Deutsch lokal für Schulgewohnte (Flying Teachers)","S-02-006"]
["S-02-007 : Deutsch lokal (Deutsch Niveau A2 (Teil 1-5) Förderkurs N/F Semi-Intensiv inkl. telc-Prüfungsvorbereitung)","S-02-007","Deutsch lokal","Deutsch Niveau A2 (Teil 1-5) Förderkurs N/F Semi-Intensiv inkl. telc-Prüfungsvorbereitung","Klubschule Migros Zürich","published","2021-01-01","2099-12-31","2020-12-21","Deutsch lokal (Deutsch Niveau A2 (Teil 1-5) Förderkurs N/F Semi-Intensiv inkl. telc-Prüfungsvorbereitung)","S-02-007 : Deutsch Niveau A2 (Teil 1-5) Förderkurs N/F Semi-Intensiv inkl. telc-Prüfungsvorbereitung (Klubschule Migros Zürich)","S-02-007"]
["S-02-008 : Deutsch lokal (Deutsch am Nachmittag / am Abend / am Samstag)","S-02-008","Deutsch lokal","Deutsch am Nachmittag / am Abend / am Samstag","Stiftung ECAP","published","2021-01-01","2099-12-31","2020-12-21","Deutsch lokal (Deutsch am Nachmittag / am Abend / am Samstag)","S-02-008 : Deutsch am Nachmittag / am Abend / am Samstag (Stiftung ECAP)","S-02-008"]
["S-02-009 : Deutsch lokal (Deutsch lokal für Schulungewohnte)","S-02-009","Deutsch lokal","Deutsch lokal für Schulungewohnte","Flying Teachers","published","2021-01-01","2099-12-31","2020-12-21","Deutsch lokal (Deutsch lokal für Schulungewohnte)","S-02-009 : Deutsch lokal für Schulungewohnte (Flying Teachers)","S-02-009"]
["S-02-011 : Deutsch lokal (Sprechkurs)","S-02-011","Deutsch lokal","Sprechkurs","SAH Schaffhausen","published","2022-01-01","2099-12-31","2022-09-15","Deutsch lokal (Sprechkurs)","S-02-011 : Sprech- und handlungsorientierte Kurse A1, A2 (SAH Schaffhausen)","S-02-011"]
["S-02-012 : Deutsch lokal (Deutsch Niveau A1, Einstiegskurs N/F, Teil 1-6 )","S-02-012","Deutsch lokal","Deutsch Niveau A1, Einstiegskurs N/F, Teil 1-6 ","Klubschule Migros Zürich","published","2022-01-01","2099-12-31","2022-09-15","Deutsch lokal (Deutsch Niveau A1, Einstiegskurs N/F, Teil 1-6 )","S-02-012 : Deutsch Niveau A1, Einstiegskurs N/F (Teil 1-6) inkl. telc-Prüfungstraining (Klubschule Migros Zürich)","S-02-012"]
["S-02-014 : Deutsch lokal (Deutsch lokal, semi-intensiv, A1 - A2)","S-02-014","Deutsch lokal","Deutsch lokal, semi-intensiv, A1 - A2","Klubschule Migros Zürich","published","2022-09-15","2099-12-31","2022-09-15","Deutsch lokal (Deutsch lokal, semi-intensiv, A1 - A2)",null,"S-02-014"]
["S-02-016 : Deutsch lokal (Deutschkurs - erste Schritte in der Schweiz)","S-02-016","Deutsch lokal","Deutschkurs - erste Schritte in der Schweiz","machbar Bildungs-GmbH","published","2022-09-15","2099-12-31","2022-09-15","Deutsch lokal (Deutschkurs - erste Schritte in der Schweiz)",null,"S-02-016"]
["S-02-018 : Deutsch lokal (Deutsch lokal)","S-02-018","Deutsch lokal","Deutsch lokal","Zweckverband SNH","published","2022-09-15","2099-12-31","2022-09-15","Deutsch lokal (Deutsch lokal)",null,"S-02-018"]
["S-02-019 : Deutsch lokal (Gemeindekurse Deutsch A1 und A2 mit Kinderbetreuung)","S-02-019","Deutsch lokal","Gemeindekurse Deutsch A1 und A2 mit Kinderbetreuung","Basisdeutsch Uster","published","2022-09-15","2099-12-31","2022-09-15","Deutsch lokal (Gemeindekurse Deutsch A1 und A2 mit Kinderbetreuung)",null,"S-02-019"]
["S-03-001 : Alphabetisierungskurse (WTL Alphabetisierungskurse)","S-03-001","Alphabetisierungskurse","WTL Alphabetisierungskurse","WTL Werk- und Technologiezentrum Linthgebiet","published","2021-01-01","2099-12-31","2022-09-19","Alphabetisierungskurse (WTL Alphabetisierungskurse)","S-03-001 : WTL Alphabetisierungskurse (WTL Werkund Technologiezentrum Linthgebiet)","S-03-001"]
["S-03-002 : Alphabetisierungskurse (Deutsch Alphabetisierung (Alpha 1- Alpha 4) Intensiv und Deutsch Nachalphabetisierung (Lese- und Schreibtraining) Intensiv)","S-03-002","Alphabetisierungskurse","Deutsch Alphabetisierung (Alpha 1- Alpha 4) Intensiv und Deutsch Nachalphabetisierung (Lese- und Schreibtraining) Intensiv","Klubschule Migros Zürich","published","2021-01-01","2099-12-31","2020-12-21","Alphabetisierungskurse (Deutsch Alphabetisierung (Alpha 1- Alpha 4) Intensiv und Deutsch Nachalphabetisierung (Lese- und Schreibtraining) Intensiv)","S-03-002 : Deutsch Alphabetisierung (Alpha 1- Alpha 4) Intensiv und Deutsch Nachalphabetisierung (Lese- und Schreibtraining) Intensiv (Klubschule Migros Zürich)","S-03-002"]
["S-03-003 : Alphabetisierungskurse (Deutsch Alphabetisierung (Alpha Einstieg und Alpha Aufbau 1-3) Semi-Intensiv)","S-03-003","Alphabetisierungskurse","Deutsch Alphabetisierung (Alpha Einstieg und Alpha Aufbau 1-3) Semi-Intensiv","Klubschule Migros Zürich","published","2021-01-01","2099-12-31","2020-12-21","Alphabetisierungskurse (Deutsch Alphabetisierung (Alpha Einstieg und Alpha Aufbau 1-3) Semi-Intensiv)","S-03-003 : Deutsch Alphabetisierung (Alpha Einstieg und Alpha Aufbau 1-3) Semi-Intensiv (Klubschule Migros Zürich)","S-03-003"]
["S-03-004 : Alphabetisierungskurse (AOZ Alpha intensiv inkl. Deutsch für Langsamlernende (mit Kinderbetreuung))","S-03-004","Alphabetisierungskurse","AOZ Alpha intensiv inkl. Deutsch für Langsamlernende (mit Kinderbetreuung)","Asyl-Organisation Zürich (AOZ)","published","2021-01-01","2099-12-31","2020-12-21","Alphabetisierungskurse (AOZ Alpha intensiv inkl. Deutsch für Langsamlernende (mit Kinderbetreuung))","S-03-004 : AOZ Alpha intensiv inkl. Deutsch für Langsamlernende (mit Kinderbetreuung) (Asyl-Organisation Zürich (AOZ))","S-03-004"]
["S-03-005 : Alphabetisierungskurse (AOZ Alpha semi-intensiv inkl. Deutsch für Langsamlernende (mit Kinderbetreuung))","S-03-005","Alphabetisierungskurse","AOZ Alpha semi-intensiv inkl. Deutsch für Langsamlernende (mit Kinderbetreuung)","Asyl-Organisation Zürich (AOZ)","published","2021-01-01","2099-12-31","2020-12-21","Alphabetisierungskurse (AOZ Alpha semi-intensiv inkl. Deutsch für Langsamlernende (mit Kinderbetreuung))","S-03-005 : AOZ Alpha semi-intensiv inkl. Deutsch für Langsamlernende (mit Kinderbetreuung) (Asyl-Organisation Zürich (AOZ))","S-03-005"]
["S-03-006 : Alphabetisierungskurse (Alphabetisierung)","S-03-006","Alphabetisierungskurse","Alphabetisierung","Academia Integration","published","2021-01-01","2099-12-31","2020-12-21","Alphabetisierungskurse (Alphabetisierung)","S-03-006 : Alphabetisierung (Academia Integration)","S-03-006"]
["S-03-007 : Alphabetisierungskurse (Alphabetisierung)","S-03-007","Alphabetisierungskurse","Alphabetisierung","Stiftung ECAP","published","2021-01-01","2099-12-31","2020-12-21","Alphabetisierungskurse (Alphabetisierung)","S-03-007 : Alphabetisierung (Stiftung ECAP)","S-03-007"]
["S-03-008 : Alphabetisierungskurse (Alphabetisierungskurse semi-intensiv mit Kinderbetreuung)","S-03-008","Alphabetisierungskurse","Alphabetisierungskurse semi-intensiv mit Kinderbetreuung","Akrotea.ch GmbH","published","2021-01-01","2099-12-31","2020-12-21","Alphabetisierungskurse (Alphabetisierungskurse semi-intensiv mit Kinderbetreuung)","S-03-008 : Alphabetisierungskurse semi-intensiv mit Kinderbetreuung (Akrotea.ch GmbH)","S-03-008"]
["S-03-009 : Alphabetisierungskurse (Alphabetisierung und Nachalphabetisierung)","S-03-009","Alphabetisierungskurse","Alphabetisierung und Nachalphabetisierung","HEI Integration AG","published","2021-07-01","2099-12-31","2021-06-22","Alphabetisierungskurse (Alphabetisierung und Nachalphabetisierung)","S-03-009 : Alphabetisierung und Nachalphabetisierung (HEI Integration AG)","S-03-009"]
["S-03-010 : Alphabetisierungskurse (Lesen und Schreiben lernen / Lesen und Schreiben üben)","S-03-010","Alphabetisierungskurse","Lesen und Schreiben lernen / Lesen und Schreiben üben","Stiftung WBK (Weiterbildungskurse) Dübendorf","published","2021-01-01","2099-12-31","2020-12-21","Alphabetisierungskurse (Lesen und Schreiben lernen / Lesen und Schreiben üben)","S-03-010 : Lesen und Schreiben lernen / Lesen und Schreiben üben (Stiftung WBK (Weiterbildungskurse) Dübendorf)","S-03-010"]
["S-03-011 : Alphabetisierungskurse (Deutsch - Alphabetisierungsprogramm)","S-03-011","Alphabetisierungskurse","Deutsch - Alphabetisierungsprogramm","FEMIA, Bildung und Kultur für Migrantinnen","published","2021-01-01","2099-12-31","2020-12-21","Alphabetisierungskurse (Deutsch - Alphabetisierungsprogramm)","S-03-011 : Deutsch - Alphabetisierungsprogramm (FEMIA, Bildung und Kultur für Migrantinnen)","S-03-011"]
["S-03-012 : Alphabetisierungskurse (Alphabetisierungskurs mit Kinderbetreuung)","S-03-012","Alphabetisierungskurse","Alphabetisierungskurs mit Kinderbetreuung","Stiftung ECAP","published","2021-01-01","2099-12-31","2020-12-21","Alphabetisierungskurse (Alphabetisierungskurs mit Kinderbetreuung)","S-03-012 : Alphabetisierungskurs mit Kinderbetreuung (Stiftung ECAP)","S-03-012"]
["S-03-014 : Alphabetisierungskurse (Alphabetisierungskurs)","S-03-014","Alphabetisierungskurse","Alphabetisierungskurs","SAH Schaffhausen","published","2022-01-01","2099-12-31","2022-09-15","Alphabetisierungskurse (Alphabetisierungskurs)","S-03-014 : Alphabetisierungskurse AL1, AL2 und AL3 (SAH Schaffhausen)","S-03-014"]
["S-03-015 : Alphabetisierungskurse (Alphabetisierung und Nachalphabetisierung intensiv)","S-03-015","Alphabetisierungskurse","Alphabetisierung und Nachalphabetisierung intensiv","HEI Integration AG","published","2023-01-01","2099-12-31","2022-12-20","Alphabetisierungskurse (Alphabetisierung und Nachalphabetisierung intensiv)"]
["ST-01-001 : Deutsch mit Ziel Arbeitsmarkt (Sprachtest (fide, telc))","ST-01-001","Deutsch mit Ziel Arbeitsmarkt","Sprachtest (fide, telc)","Diverse Institutionen","published","2021-01-01","2099-12-31","2022-09-15","Deutsch mit Ziel Arbeitsmarkt (Sprachtest (fide, telc))","ST-01-001 : diverse Sprachtests (diverse Anbieter)","ST-01-001"]
["A-02-011 : Praxisassessment (job4you Praxisassessment)","A-02-011","Praxisassessment","job4you Praxisassessment","Stiftung work4you","archive","2021-01-01","2022-09-15","2022-09-15","Praxisassessment (job4you Praxisassessment)","A-02-011 : job4you Praxisassessment (Stiftung work4you)","A-02-011"]
["AI-01-018 : Interne Arbeitseinsätze (AOZ SBB Team Clean)","AI-01-018","Interne Arbeitseinsätze","AOZ SBB Team Clean","Asyl-Organisation Zürich (AOZ)","archive","2021-01-01","2022-12-31","2022-12-20","Interne Arbeitseinsätze (AOZ SBB Team Clean)"]
["AI-03-001 : Branchenqualifizierung (Integrationsvorlehre RIESCO Gebäude- und Automobiltechnik)","AI-03-001","Branchenqualifizierung","Integrationsvorlehre RIESCO Gebäude- und Automobiltechnik","Hotel & Gastro formation Schweiz","archive","2021-01-01","2022-09-15","2022-09-15","Branchenqualifizierung (Integrationsvorlehre RIESCO Gebäude- und Automobiltechnik)",null,"AI-03-001"]
["B-01-006 : Vollschulische Bildungsangebote (Sprungbrett)","B-01-006","Vollschulische Bildungsangebote","Sprungbrett","Swiss ProWork AG","archive","2021-01-01","2022-09-15","2022-09-15","Vollschulische Bildungsangebote (Sprungbrett)",null,"B-01-006"]
["B-02-003 : Bildungsmodule (ANSCHLUSS IKT / Mathe)","B-02-003","Bildungsmodule","ANSCHLUSS IKT / Mathe","SAH Zürich","archive","2021-01-01","2022-12-31","2022-12-20","Bildungsmodule (ANSCHLUSS IKT / Mathe)","B-02-003 : ANSCHLUSS IKT / Mathe (SAH Zürich)"]
["B-02-004 : Bildungsmodule (chance4you Bildung)","B-02-004","Bildungsmodule","chance4you Bildung","Stiftung work4you","archive","2021-01-01","2022-09-15","2022-09-15","Bildungsmodule (chance4you Bildung)","B-02-004 : chance4you Bildung (Stiftung work4you)","B-02-004"]
["B-02-011 : Bildungsmodule (ANSCHLUSS Fit4Tests)","B-02-011","Bildungsmodule","ANSCHLUSS Fit4Tests","SAH Zürich","archive","2021-01-01","2022-12-31","2022-12-20","Bildungsmodule (ANSCHLUSS Fit4Tests)","B-02-011 : ANSCHLUSS Fit4Tests (SAH Zürich)","B-02-011"]
["S-01-002 : Deutsch mit Ziel Arbeitsmarkt (WTL Deutsch mit Ziel Arbeitsmarkt semi-intensiv)","S-01-002","Deutsch mit Ziel Arbeitsmarkt","WTL Deutsch mit Ziel Arbeitsmarkt semi-intensiv","WTL Werk- und Technologiezentrum Linthgebiet","archive","2021-01-01","2022-09-15","2022-09-15","Deutsch mit Ziel Arbeitsmarkt (WTL Deutsch mit Ziel Arbeitsmarkt semi-intensiv)",null,"S-01-002"]
[]
[]
[]
[null,null,null,null,null,null,null,null,null,null,null,"AI-01-001"]
[null,null,null,null,null,null,null,null,null,null,"AI-02-032 : IPT Externe Arbeitseinsätze Berufliche (Wieder-)Eingliederung (Stiftung IPT)","B-02-003"]
[null,null,null,null,null,null,null,null,null,null,null,"B-02-005"]
[null,null,null,null,null,null,null,null,null,null,null,"AI-01-019"]
[null,null,null,null,null,null,null,null,null,null,null,"AI-03-003"]
[null,null,null,null,null,null,null,null,null,null,null,"B-01-009"]
[null,null,null,null,null,null,null,null,null,null,"B-01-004 : Vorkurs DeutschPLUS+ (Berufswahlschule Bülach)","B-02-007"]
[null,null,null,null,null,null,null,null,null,null,"B-02-002 : VkB Sprungbrett (Vorbereitungskurs für die Berufsschule - «Sprungbrett») (IBBK Institut für Bildung Beratung und Kommunikation)","B-02-008"]
[null,null,null,null,null,null,null,null,null,null,"B-02-020 : IT-Grundlagen-Kurs (SAH Schaffhausen)","B-02-015"]
[null,null,null,null,null,null,null,null,null,null,null,"S-01-009"]
[]
[null,null,null,null,null,null,null,null,null,null,"S-02-010 : Muki-Deutsch (machbar GmbH)"]
[]
[]
[]
[null,null,null,null,null,null,null,null,null,null,"AI-01-001 : WTL Interne Arbeitseinsätze (WTL Werkund Technologiezentrum Linthgebiet)"]
[null,null,null,null,null,null,null,null,null,null,"AI-01-019 : AOZ Restaurant Riedbach (Asyl-Organisation Zürich (AOZ))"]
[null,null,null,null,null,null,null,null,null,null,"AI-03-003 : Integrationsvorlehre RIESCO Gastronomie (Hotel & Gastro formation Schweiz)"]
[null,null,null,null,null,null,null,null,null,null,"B-01-009 : Avanti! (ECAP Zürich)"]
[null,null,null,null,null,null,null,null,null,null,"B-02-007 : Bildungsmodul Mathematik (Academia Integration)"]
[null,null,null,null,null,null,null,null,null,null,"B-02-008 : Praxisjahr (Förderverein cocomo)"]
[null,null,null,null,null,null,null,null,null,null,"B-02-015 : Aussprache und Auftritt (HEI Integration)"]
[null,null,null,null,null,null,null,null,null,null,"S-01-009 : Fit für den Arbeitsmarkt - kompakt B1 (Academia Integration)"]

{"sheet":"Gemeinden","index":6,"n_rows":2173,"n_cols":7,"rows_kept":2173,"cut":false,"hidden":true,"merged":[]}
["Hist.-Nummer","Kanton","Bezirks-nummer","Bezirksname","BFS Gde-nummer","Gemeindename","Datum der Aufnahme"]
[11735,"ZH",102,"Andelfingen",21,"Adlikon","1872-01-01"]
[11745,"ZH",106,"Horgen",131,"Adliswil","1893-01-01"]
[14365,"ZH",111,"Dietikon",241,"Aesch (ZH)","2003-01-01"]
[13256,"ZH",101,"Affoltern",1,"Aeugst am Albis","1976-11-15"]
[11742,"ZH",101,"Affoltern",2,"Affoltern am Albis","1848-09-12"]
[11777,"ZH",110,"Winterthur",211,"Altikon","1848-09-12"]
[13214,"ZH",102,"Andelfingen",30,"Andelfingen","1970-01-01"]
[11683,"ZH",103,"Bülach",51,"Bachenbülach","1848-09-12"]
[11704,"ZH",104,"Dielsdorf",81,"Bachs","1848-09-12"]
[11709,"ZH",105,"Hinwil",111,"Bäretswil","1848-09-12"]
[11685,"ZH",103,"Bülach",52,"Bassersdorf","1848-09-12"]
[15653,"ZH",108,"Pfäffikon",297,"Bauma","2015-01-01"]
[11862,"ZH",102,"Andelfingen",22,"Benken (ZH)","1848-09-12"]
[11855,"ZH",102,"Andelfingen",23,"Berg am Irchel","1848-09-12"]
[13690,"ZH",111,"Dietikon",242,"Birmensdorf (ZH)","1990-01-01"]
[11801,"ZH",101,"Affoltern",3,"Bonstetten","1848-09-12"]
[11786,"ZH",104,"Dielsdorf",82,"Boppelsen","1848-09-12"]
[11467,"ZH",110,"Winterthur",213,"Brütten","1848-09-12"]
[11478,"ZH",105,"Hinwil",112,"Bubikon","1848-09-12"]
[15513,"ZH",102,"Andelfingen",24,"Buch am Irchel","2013-01-01"]
[11456,"ZH",104,"Dielsdorf",83,"Buchs (ZH)","1848-09-12"]
[11461,"ZH",103,"Bülach",53,"Bülach","1848-09-12"]
[11573,"ZH",102,"Andelfingen",25,"Dachsen","1848-09-12"]
[11574,"ZH",110,"Winterthur",214,"Dägerlen","1848-09-12"]
[11578,"ZH",104,"Dielsdorf",84,"Dällikon","1848-09-12"]
[11581,"ZH",104,"Dielsdorf",85,"Dänikon","1848-09-12"]
[11583,"ZH",110,"Winterthur",215,"Dättlikon","1848-09-12"]
[11567,"ZH",104,"Dielsdorf",86,"Dielsdorf","1848-09-12"]
[13691,"ZH",111,"Dietikon",243,"Dietikon","1990-01-01"]
[11563,"ZH",103,"Bülach",54,"Dietlikon","1848-09-12"]
[11565,"ZH",110,"Winterthur",216,"Dinhard","1848-09-12"]
[12182,"ZH",102,"Andelfingen",26,"Dorf","1848-09-12"]
[12205,"ZH",109,"Uster",191,"Dübendorf","1848-09-12"]
[12159,"ZH",105,"Hinwil",113,"Dürnten","1848-09-12"]
[12123,"ZH",109,"Uster",192,"Egg","1848-09-12"]
[12168,"ZH",103,"Bülach",55,"Eglisau","1848-09-12"]
[16081,"ZH",110,"Winterthur",294,"Elgg","2018-01-01"]
[12144,"ZH",110,"Winterthur",218,"Ellikon an der Thur","1848-09-12"]
[12294,"ZH",110,"Winterthur",219,"Elsau","1922-01-01"]
[12292,"ZH",103,"Bülach",56,"Embrach","1931-01-01"]
[12301,"ZH",107,"Meilen",151,"Erlenbach (ZH)","1848-09-12"]
[12248,"ZH",109,"Uster",193,"Fällanden","1848-09-12"]
[11989,"ZH",108,"Pfäffikon",172,"Fehraltorf","1848-09-12"]
[11973,"ZH",102,"Andelfingen",27,"Feuerthalen","1848-09-12"]
[12002,"ZH",105,"Hinwil",114,"Fischenthal","1848-09-12"]
[11997,"ZH",102,"Andelfingen",28,"Flaach","1848-09-12"]
[11935,"ZH",102,"Andelfingen",29,"Flurlingen","1848-09-12"]
[11960,"ZH",103,"Bülach",57,"Freienstein-Teufen","1958-01-01"]
[13692,"ZH",111,"Dietikon",244,"Geroldswil","1990-01-01"]
[12056,"ZH",103,"Bülach",58,"Glattfelden","1848-09-12"]
[12023,"ZH",105,"Hinwil",115,"Gossau (ZH)","1848-09-12"]
[12073,"ZH",109,"Uster",194,"Greifensee","1848-09-12"]
[11970,"ZH",105,"Hinwil",116,"Grüningen","1848-09-12"]
[12001,"ZH",110,"Winterthur",220,"Hagenbuch","1848-09-12"]
[11992,"ZH",101,"Affoltern",4,"Hausen am Albis","1911-01-01"]
[12249,"ZH",101,"Affoltern",5,"Hedingen","1848-09-12"]
[12240,"ZH",102,"Andelfingen",31,"Henggart","1848-09-12"]
[12316,"ZH",107,"Meilen",152,"Herrliberg","1848-09-12"]
[12283,"ZH",110,"Winterthur",221,"Hettlingen","1848-09-12"]
[12156,"ZH",105,"Hinwil",117,"Hinwil","1848-09-12"]
[12161,"ZH",108,"Pfäffikon",173,"Hittnau","1848-09-12"]
[12166,"ZH",103,"Bülach",59,"Hochfelden","1848-09-12"]
[12143,"ZH",107,"Meilen",153,"Hombrechtikon","1848-09-12"]
[16080,"ZH",106,"Horgen",295,"Horgen","2018-01-01"]
[12220,"ZH",103,"Bülach",60,"Höri","1848-09-12"]
[12173,"ZH",102,"Andelfingen",32,"Humlikon","1872-01-01"]
[12178,"ZH",103,"Bülach",61,"Hüntwangen","1848-09-12"]
[12181,"ZH",104,"Dielsdorf",87,"Hüttikon","1848-09-12"]
[15671,"ZH",108,"Pfäffikon",296,"Illnau-Effretikon","2016-01-01"]
[12671,"ZH",101,"Affoltern",6,"Kappel am Albis","1911-01-01"]
[12701,"ZH",106,"Horgen",135,"Kilchberg (ZH)","1848-09-12"]
[12699,"ZH",102,"Andelfingen",33,"Kleinandelfingen","1848-09-12"]
[12673,"ZH",103,"Bülach",62,"Kloten","1848-09-12"]
[12674,"ZH",101,"Affoltern",7,"Knonau","1848-09-12"]
[12592,"ZH",107,"Meilen",154,"Küsnacht (ZH)","1848-09-12"]
[12637,"ZH",106,"Horgen",136,"Langnau am Albis","1848-09-12"]
[12635,"ZH",102,"Andelfingen",34,"Laufen-Uhwiesen","1848-09-12"]
[12821,"ZH",108,"Pfäffikon",176,"Lindau","1848-09-12"]
[12720,"ZH",103,"Bülach",63,"Lufingen","1848-09-12"]
[12754,"ZH",107,"Meilen",155,"Männedorf","1848-09-12"]
[12742,"ZH",102,"Andelfingen",35,"Marthalen","1848-09-12"]
[12738,"ZH",101,"Affoltern",8,"Maschwanden","1848-09-12"]
[12620,"ZH",109,"Uster",195,"Maur","1848-09-12"]
[12408,"ZH",107,"Meilen",156,"Meilen","1848-09-12"]
[12433,"ZH",101,"Affoltern",9,"Mettmenstetten","1848-09-12"]
[12427,"ZH",109,"Uster",196,"Mönchaltorf","1848-09-12"]
[12537,"ZH",104,"Dielsdorf",88,"Neerach","1848-09-12"]
[15514,"ZH",110,"Winterthur",223,"Neftenbach","2013-01-01"]
[12534,"ZH",104,"Dielsdorf",89,"Niederglatt","1848-09-12"]
[12560,"ZH",104,"Dielsdorf",90,"Niederhasli","1848-09-12"]
[12568,"ZH",104,"Dielsdorf",91,"Niederweningen","1848-09-12"]
[12547,"ZH",103,"Bülach",64,"Nürensdorf","1848-09-12"]
[12524,"ZH",103,"Bülach",65,"Oberembrach","1848-09-12"]
[13693,"ZH",111,"Dietikon",245,"Oberengstringen","1990-01-01"]
[12469,"ZH",104,"Dielsdorf",92,"Oberglatt","1848-09-12"]
[12461,"ZH",106,"Horgen",137,"Oberrieden","1848-09-12"]
[12447,"ZH",104,"Dielsdorf",93,"Oberweningen","1848-09-12"]
[12497,"ZH",101,"Affoltern",10,"Obfelden","1848-09-12"]
[12501,"ZH",107,"Meilen",157,"Oetwil am See","1848-09-12"]
[13694,"ZH",111,"Dietikon",246,"Oetwil an der Limmat","1990-01-01"]
[12483,"ZH",103,"Bülach",66,"Opfikon","1848-09-12"]
[13128,"ZH",102,"Andelfingen",37,"Ossingen","1848-09-12"]
[13126,"ZH",104,"Dielsdorf",94,"Otelfingen","1848-09-12"]
[13124,"ZH",101,"Affoltern",11,"Ottenbach","1848-09-12"]
[13137,"ZH",108,"Pfäffikon",177,"Pfäffikon","1848-09-12"]
[13145,"ZH",110,"Winterthur",224,"Pfungen","1848-09-12"]
[13090,"ZH",103,"Bülach",67,"Rafz","1848-09-12"]
[13166,"ZH",104,"Dielsdorf",95,"Regensberg","1848-09-12"]
[13168,"ZH",104,"Dielsdorf",96,"Regensdorf","1848-09-12"]
[12912,"ZH",102,"Andelfingen",38,"Rheinau","1848-09-12"]
[12907,"ZH",106,"Horgen",138,"Richterswil","1848-09-12"]
[12889,"ZH",110,"Winterthur",225,"Rickenbach (ZH)","1848-09-12"]
[12891,"ZH",101,"Affoltern",12,"Rifferswil","1848-09-12"]
[12919,"ZH",103,"Bülach",68,"Rorbas","1848-09-12"]
[12834,"ZH",104,"Dielsdorf",97,"Rümlang","1848-09-12"]
[12832,"ZH",106,"Horgen",139,"Rüschlikon","1848-09-12"]
[12831,"ZH",108,"Pfäffikon",178,"Russikon","1848-09-12"]
[12883,"ZH",105,"Hinwil",118,"Rüti (ZH)","1848-09-12"]
[14120,"ZH",110,"Winterthur",226,"Schlatt (ZH)","1999-01-01"]
[13046,"ZH",104,"Dielsdorf",98,"Schleinikon","1848-09-12"]
[13695,"ZH",111,"Dietikon",247,"Schlieren","1990-01-01"]
[13037,"ZH",104,"Dielsdorf",99,"Schöfflisdorf","1848-09-12"]
[12956,"ZH",109,"Uster",197,"Schwerzenbach","1848-09-12"]
[12951,"ZH",105,"Hinwil",119,"Seegräben","1848-09-12"]
[12977,"ZH",110,"Winterthur",227,"Seuzach","1848-09-12"]
[10383,"ZH",104,"Dielsdorf",100,"Stadel","1907-01-01"]
[10363,"ZH",107,"Meilen",158,"Stäfa","1848-09-12"]
[10575,"ZH",101,"Affoltern",13,"Stallikon","1848-09-12"]
[16122,"ZH",102,"Andelfingen",292,"Stammheim","2019-01-01"]
[10597,"ZH",104,"Dielsdorf",101,"Steinmaur","1848-09-12"]
[10563,"ZH",102,"Andelfingen",39,"Thalheim an der Thur","1878-01-01"]
[10691,"ZH",106,"Horgen",141,"Thalwil","1848-09-12"]
[10898,"ZH",102,"Andelfingen",40,"Trüllikon","1879-01-01"]
[10899,"ZH",102,"Andelfingen",41,"Truttikon","1879-01-01"]
[10857,"ZH",110,"Winterthur",228,"Turbenthal","1848-09-12"]
[13259,"ZH",107,"Meilen",159,"Uetikon am See","1977-03-10"]
[13696,"ZH",111,"Dietikon",248,"Uitikon","1990-01-01"]
[13697,"ZH",111,"Dietikon",249,"Unterengstringen","1990-01-01"]
[13698,"ZH",111,"Dietikon",250,"Urdorf","1990-01-01"]
[10940,"ZH",109,"Uster",198,"Uster","1848-09-12"]
[10365,"ZH",102,"Andelfingen",43,"Volken","1848-09-12"]
[10368,"ZH",109,"Uster",199,"Volketswil","1848-09-12"]
[16123,"ZH",106,"Horgen",293,"Wädenswil","2019-01-01"]
[10459,"ZH",105,"Hinwil",120,"Wald (ZH)","1848-09-12"]
[10451,"ZH",103,"Bülach",69,"Wallisellen","1916-01-01"]
[13250,"ZH",109,"Uster",200,"Wangen-Brüttisellen","1976-01-01"]
[10443,"ZH",103,"Bülach",70,"Wasterkingen","1848-09-12"]
[10448,"ZH",104,"Dielsdorf",102,"Weiach","1848-09-12"]
[13699,"ZH",111,"Dietikon",251,"Weiningen (ZH)","1990-01-01"]
[10389,"ZH",108,"Pfäffikon",180,"Weisslingen","1848-09-12"]
[13255,"ZH",101,"Affoltern",14,"Wettswil am Albis","1976-11-15"]
[10277,"ZH",105,"Hinwil",121,"Wetzikon (ZH)","1848-09-12"]
[15631,"ZH",110,"Winterthur",298,"Wiesendangen","2014-01-01"]
[10268,"ZH",103,"Bülach",71,"Wil (ZH)","1848-09-12"]
[10242,"ZH",108,"Pfäffikon",181,"Wila","1848-09-12"]
[10334,"ZH",108,"Pfäffikon",182,"Wildberg","1848-09-12"]
[10331,"ZH",103,"Bülach",72,"Winkel","1848-09-12"]
[10347,"ZH",110,"Winterthur",230,"Winterthur","1922-01-01"]
[10312,"ZH",110,"Winterthur",231,"Zell (ZH)","1848-09-12"]
[13683,"ZH",107,"Meilen",161,"Zollikon","1986-01-01"]
[10326,"ZH",107,"Meilen",160,"Zumikon","1848-09-12"]
[13688,"ZH",112,"Zürich",261,"Zürich","1990-01-01"]
[14995,"BE",243,"Seeland",301,"Aarberg","2010-01-01"]
[14996,"BE",243,"Seeland",302,"Bargen (BE)","2010-01-01"]
[14997,"BE",243,"Seeland",303,"Grossaffoltern","2010-01-01"]
[16124,"BE",243,"Seeland",304,"Kallnach","2019-01-01"]
[14999,"BE",243,"Seeland",305,"Kappelen","2010-01-01"]
[15474,"BE",243,"Seeland",306,"Lyss","2011-01-01"]
[15001,"BE",246,"Bern-Mittelland",307,"Meikirch","2010-01-01"]
[15003,"BE",243,"Seeland",309,"Radelfingen","2010-01-01"]
[15672,"BE",243,"Seeland",310,"Rapperswil (BE)","2016-01-01"]
[15005,"BE",243,"Seeland",311,"Schüpfen","2010-01-01"]
[15006,"BE",243,"Seeland",312,"Seedorf (BE)","2010-01-01"]
[15007,"BE",244,"Oberaargau",321,"Aarwangen","2010-01-01"]
[15008,"BE",244,"Oberaargau",322,"Auswil","2010-01-01"]
[15009,"BE",244,"Oberaargau",323,"Bannwil","2010-01-01"]
[15010,"BE",244,"Oberaargau",324,"Bleienbach","2010-01-01"]
[15011,"BE",244,"Oberaargau",325,"Busswil bei Melchnau","2010-01-01"]
[15012,"BE",244,"Oberaargau",326,"Gondiswil","2010-01-01"]
[16606,"BE",244,"Oberaargau",329,"Langenthal","2021-01-01"]
[15015,"BE",244,"Oberaargau",331,"Lotzwil","2010-01-01"]
[15475,"BE",244,"Oberaargau",332,"Madiswil","2011-01-01"]
[15017,"BE",244,"Oberaargau",333,"Melchnau","2010-01-01"]
[15019,"BE",244,"Oberaargau",335,"Oeschenbach","2010-01-01"]
[15020,"BE",244,"Oberaargau",336,"Reisiswil","2010-01-01"]
[15021,"BE",244,"Oberaargau",337,"Roggwil (BE)","2010-01-01"]
[15022,"BE",244,"Oberaargau",338,"Rohrbach","2010-01-01"]
[15023,"BE",244,"Oberaargau",339,"Rohrbachgraben","2010-01-01"]
[15024,"BE",244,"Oberaargau",340,"Rütschelen","2010-01-01"]
[15025,"BE",244,"Oberaargau",341,"Schwarzhäusern","2010-01-01"]
[15026,"BE",244,"Oberaargau",342,"Thunstetten","2010-01-01"]
[15027,"BE",244,"Oberaargau",344,"Ursenbach","2010-01-01"]
[15028,"BE",244,"Oberaargau",345,"Wynau","2010-01-01"]
[15029,"BE",246,"Bern-Mittelland",351,"Bern","2010-01-01"]
[15030,"BE",246,"Bern-Mittelland",352,"Bolligen","2010-01-01"]
[15031,"BE",246,"Bern-Mittelland",353,"Bremgarten bei Bern","2010-01-01"]
[15032,"BE",246,"Bern-Mittelland",354,"Kirchlindach","2010-01-01"]
[15033,"BE",246,"Bern-Mittelland",355,"Köniz","2010-01-01"]
[15034,"BE",246,"Bern-Mittelland",356,"Muri bei Bern","2010-01-01"]
[15035,"BE",246,"Bern-Mittelland",357,"Oberbalm","2010-01-01"]
[15036,"BE",246,"Bern-Mittelland",358,"Stettlen","2010-01-01"]
[15037,"BE",246,"Bern-Mittelland",359,"Vechigen","2010-01-01"]
[15038,"BE",246,"Bern-Mittelland",360,"Wohlen bei Bern","2010-01-01"]
[15039,"BE",246,"Bern-Mittelland",361,"Zollikofen","2010-01-01"]
[15040,"BE",246,"Bern-Mittelland",362,"Ittigen","2010-01-01"]
[15041,"BE",246,"Bern-Mittelland",363,"Ostermundigen","2010-01-01"]
[15042,"BE",242,"Biel/Bienne",371,"Biel/Bienne","2010-01-01"]
[15043,"BE",242,"Biel/Bienne",372,"Evilard","2010-01-01"]
[15044,"BE",243,"Seeland",381,"Arch","2010-01-01"]
[15045,"BE",243,"Seeland",382,"Büetigen","2010-01-01"]
[15046,"BE",243,"Seeland",383,"Büren an der Aare","2010-01-01"]
[15048,"BE",243,"Seeland",385,"Diessbach bei Büren","2010-01-01"]
[15049,"BE",243,"Seeland",386,"Dotzigen","2010-01-01"]
[15050,"BE",242,"Biel/Bienne",387,"Lengnau (BE)","2010-01-01"]
[15051,"BE",243,"Seeland",388,"Leuzigen","2010-01-01"]
[15052,"BE",243,"Seeland",389,"Meienried","2010-01-01"]
[15053,"BE",242,"Biel/Bienne",390,"Meinisberg","2010-01-01"]
[15054,"BE",243,"Seeland",391,"Oberwil bei Büren","2010-01-01"]
[15055,"BE",242,"Biel/Bienne",392,"Pieterlen","2010-01-01"]
[15056,"BE",243,"Seeland",393,"Rüti bei Büren","2010-01-01"]
[15057,"BE",243,"Seeland",394,"Wengi","2010-01-01"]
[15058,"BE",245,"Emmental",401,"Aefligen","2010-01-01"]
[15059,"BE",245,"Emmental",402,"Alchenstorf","2010-01-01"]
[15060,"BE",246,"Bern-Mittelland",403,"Bäriswil","2010-01-01"]
[15061,"BE",245,"Emmental",404,"Burgdorf","2010-01-01"]
[15673,"BE",245,"Emmental",405,"Ersigen","2016-01-01"]
[15063,"BE",245,"Emmental",406,"Hasle bei Burgdorf","2010-01-01"]
[15064,"BE",245,"Emmental",407,"Heimiswil","2010-01-01"]
[15065,"BE",245,"Emmental",408,"Hellsau","2010-01-01"]
[16607,"BE",245,"Emmental",409,"Hindelbank","2021-01-01"]
[15067,"BE",245,"Emmental",410,"Höchstetten","2010-01-01"]
[15068,"BE",245,"Emmental",411,"Kernenried","2010-01-01"]
[15069,"BE",245,"Emmental",412,"Kirchberg (BE)","2010-01-01"]
[15070,"BE",245,"Emmental",413,"Koppigen","2010-01-01"]
[15071,"BE",245,"Emmental",414,"Krauchthal","2010-01-01"]
[15072,"BE",245,"Emmental",415,"Lyssach","2010-01-01"]
[15075,"BE",245,"Emmental",418,"Oberburg","2010-01-01"]
[15077,"BE",245,"Emmental",420,"Rüdtligen-Alchenflüh","2010-01-01"]
[15078,"BE",245,"Emmental",421,"Rumendingen","2010-01-01"]
[15079,"BE",245,"Emmental",422,"Rüti bei Lyssach","2010-01-01"]
[15080,"BE",245,"Emmental",423,"Willadingen","2010-01-01"]
[15081,"BE",245,"Emmental",424,"Wynigen","2010-01-01"]
[15082,"BE",241,"Jura bernois",431,"Corgémont","2010-01-01"]
[15083,"BE",241,"Jura bernois",432,"Cormoret","2010-01-01"]
[15084,"BE",241,"Jura bernois",433,"Cortébert","2010-01-01"]
[15085,"BE",241,"Jura bernois",434,"Courtelary","2010-01-01"]
[15086,"BE",241,"Jura bernois",435,"La Ferrière","2010-01-01"]
[15088,"BE",241,"Jura bernois",437,"Mont-Tramelan","2010-01-01"]
[15089,"BE",241,"Jura bernois",438,"Orvin","2010-01-01"]
[15092,"BE",241,"Jura bernois",441,"Renan (BE)","2010-01-01"]
[15093,"BE",241,"Jura bernois",442,"Romont (BE)","2010-01-01"]
[15094,"BE",241,"Jura bernois",443,"Saint-Imier","2010-01-01"]
[15095,"BE",241,"Jura bernois",444,"Sonceboz-Sombeval","2010-01-01"]
[15096,"BE",241,"Jura bernois",445,"Sonvilier","2010-01-01"]
[15097,"BE",241,"Jura bernois",446,"Tramelan","2010-01-01"]
[15099,"BE",241,"Jura bernois",448,"Villeret","2010-01-01"]
[15632,"BE",241,"Jura bernois",449,"Sauge","2014-01-01"]
[15658,"BE",241,"Jura bernois",450,"Péry-La Heutte","2015-01-01"]
[15100,"BE",243,"Seeland",491,"Brüttelen","2010-01-01"]
[15101,"BE",243,"Seeland",492,"Erlach","2010-01-01"]
[15102,"BE",243,"Seeland",493,"Finsterhennen","2010-01-01"]
[15103,"BE",243,"Seeland",494,"Gals","2010-01-01"]
[15104,"BE",243,"Seeland",495,"Gampelen","2010-01-01"]
[15105,"BE",243,"Seeland",496,"Ins","2010-01-01"]
[15106,"BE",243,"Seeland",497,"Lüscherz","2010-01-01"]
[15107,"BE",243,"Seeland",498,"Müntschemier","2010-01-01"]
[15108,"BE",243,"Seeland",499,"Siselen","2010-01-01"]
[15109,"BE",243,"Seeland",500,"Treiten","2010-01-01"]
[15110,"BE",243,"Seeland",501,"Tschugg","2010-01-01"]
[15111,"BE",243,"Seeland",502,"Vinelz","2010-01-01"]
[15113,"BE",245,"Emmental",533,"Bätterkinden","2010-01-01"]
[15115,"BE",246,"Bern-Mittelland",535,"Deisswil bei Münchenbuchsee","2010-01-01"]
[15116,"BE",246,"Bern-Mittelland",536,"Diemerswil","2010-01-01"]
[15633,"BE",246,"Bern-Mittelland",538,"Fraubrunnen","2014-01-01"]
[15634,"BE",246,"Bern-Mittelland",540,"Jegenstorf","2014-01-01"]
[15120,"BE",246,"Bern-Mittelland",541,"Iffwil","2010-01-01"]
[15122,"BE",246,"Bern-Mittelland",543,"Mattstetten","2010-01-01"]
[15123,"BE",246,"Bern-Mittelland",544,"Moosseedorf","2010-01-01"]
[15125,"BE",246,"Bern-Mittelland",546,"Münchenbuchsee","2010-01-01"]
[15130,"BE",246,"Bern-Mittelland",551,"Urtenen-Schönbühl","2010-01-01"]
[15131,"BE",245,"Emmental",552,"Utzenstorf","2010-01-01"]
[15132,"BE",246,"Bern-Mittelland",553,"Wiggiswil","2010-01-01"]
[15133,"BE",245,"Emmental",554,"Wiler bei Utzenstorf","2010-01-01"]
[15135,"BE",245,"Emmental",556,"Zielebach","2010-01-01"]
[15136,"BE",246,"Bern-Mittelland",557,"Zuzwil (BE)","2010-01-01"]
[15137,"BE",249,"Frutigen-Niedersimmental",561,"Adelboden","2010-01-01"]
[15138,"BE",249,"Frutigen-Niedersimmental",562,"Aeschi bei Spiez","2010-01-01"]
[15139,"BE",249,"Frutigen-Niedersimmental",563,"Frutigen","2010-01-01"]
[15140,"BE",249,"Frutigen-Niedersimmental",564,"Kandergrund","2010-01-01"]
[15141,"BE",249,"Frutigen-Niedersimmental",565,"Kandersteg","2010-01-01"]
[15142,"BE",249,"Frutigen-Niedersimmental",566,"Krattigen","2010-01-01"]
[15143,"BE",249,"Frutigen-Niedersimmental",567,"Reichenbach im Kandertal","2010-01-01"]
[15144,"BE",250,"Interlaken-Oberhasli",571,"Beatenberg","2010-01-01"]
[15145,"BE",250,"Interlaken-Oberhasli",572,"Bönigen","2010-01-01"]
[15146,"BE",250,"Interlaken-Oberhasli",573,"Brienz (BE)","2010-01-01"]
[15147,"BE",250,"Interlaken-Oberhasli",574,"Brienzwiler","2010-01-01"]
[15148,"BE",250,"Interlaken-Oberhasli",575,"Därligen","2010-01-01"]
[15149,"BE",250,"Interlaken-Oberhasli",576,"Grindelwald","2010-01-01"]
[15150,"BE",250,"Interlaken-Oberhasli",577,"Gsteigwiler","2010-01-01"]
[15151,"BE",250,"Interlaken-Oberhasli",578,"Gündlischwand","2010-01-01"]
[15152,"BE",250,"Interlaken-Oberhasli",579,"Habkern","2010-01-01"]
[15153,"BE",250,"Interlaken-Oberhasli",580,"Hofstetten bei Brienz","2010-01-01"]
[15154,"BE",250,"Interlaken-Oberhasli",581,"Interlaken","2010-01-01"]
[15155,"BE",250,"Interlaken-Oberhasli",582,"Iseltwald","2010-01-01"]
[15156,"BE",250,"Interlaken-Oberhasli",584,"Lauterbrunnen","2010-01-01"]
[15157,"BE",250,"Interlaken-Oberhasli",585,"Leissigen","2010-01-01"]
[15158,"BE",250,"Interlaken-Oberhasli",586,"Lütschental","2010-01-01"]
[15159,"BE",250,"Interlaken-Oberhasli",587,"Matten bei Interlaken","2010-01-01"]
[15160,"BE",250,"Interlaken-Oberhasli",588,"Niederried bei Interlaken","2010-01-01"]
[15161,"BE",250,"Interlaken-Oberhasli",589,"Oberried am Brienzersee","2010-01-01"]
[15162,"BE",250,"Interlaken-Oberhasli",590,"Ringgenberg (BE)","2010-01-01"]
[15163,"BE",250,"Interlaken-Oberhasli",591,"Saxeten","2010-01-01"]
[15164,"BE",250,"Interlaken-Oberhasli",592,"Schwanden bei Brienz","2010-01-01"]
[15165,"BE",250,"Interlaken-Oberhasli",593,"Unterseen","2010-01-01"]
[15166,"BE",250,"Interlaken-Oberhasli",594,"Wilderswil","2010-01-01"]
[15167,"BE",246,"Bern-Mittelland",602,"Arni (BE)","2010-01-01"]
[15168,"BE",246,"Bern-Mittelland",603,"Biglen","2010-01-01"]
[15170,"BE",246,"Bern-Mittelland",605,"Bowil","2010-01-01"]
[15171,"BE",246,"Bern-Mittelland",606,"Brenzikofen","2010-01-01"]
[15172,"BE",246,"Bern-Mittelland",607,"Freimettigen","2010-01-01"]
[16082,"BE",246,"Bern-Mittelland",608,"Grosshöchstetten","2018-01-01"]
[15174,"BE",246,"Bern-Mittelland",609,"Häutligen","2010-01-01"]
[15175,"BE",246,"Bern-Mittelland",610,"Herbligen","2010-01-01"]
[15176,"BE",246,"Bern-Mittelland",611,"Kiesen","2010-01-01"]
[15177,"BE",246,"Bern-Mittelland",612,"Konolfingen","2010-01-01"]
[15178,"BE",246,"Bern-Mittelland",613,"Landiswil","2010-01-01"]
[15179,"BE",246,"Bern-Mittelland",614,"Linden","2010-01-01"]
[15180,"BE",246,"Bern-Mittelland",615,"Mirchel","2010-01-01"]
[15688,"BE",246,"Bern-Mittelland",616,"Münsingen","2017-01-01"]
[15182,"BE",246,"Bern-Mittelland",617,"Niederhünigen","2010-01-01"]
[15635,"BE",246,"Bern-Mittelland",619,"Oberdiessbach","2014-01-01"]
[15183,"BE",246,"Bern-Mittelland",620,"Oberthal","2010-01-01"]
[15184,"BE",246,"Bern-Mittelland",622,"Oppligen","2010-01-01"]
[15185,"BE",246,"Bern-Mittelland",623,"Rubigen","2010-01-01"]
[15188,"BE",246,"Bern-Mittelland",626,"Walkringen","2010-01-01"]
[15189,"BE",246,"Bern-Mittelland",627,"Worb","2010-01-01"]
[15190,"BE",246,"Bern-Mittelland",628,"Zäziwil","2010-01-01"]
[15191,"BE",246,"Bern-Mittelland",629,"Oberhünigen","2010-01-01"]
[15192,"BE",246,"Bern-Mittelland",630,"Allmendingen","2010-01-01"]
[15194,"BE",246,"Bern-Mittelland",632,"Wichtrach","2010-01-01"]
[15195,"BE",246,"Bern-Mittelland",661,"Clavaleyres","2010-01-01"]
[15196,"BE",246,"Bern-Mittelland",662,"Ferenbalm","2010-01-01"]
[15197,"BE",246,"Bern-Mittelland",663,"Frauenkappelen","2010-01-01"]
[15199,"BE",246,"Bern-Mittelland",665,"Gurbrü","2010-01-01"]
[15200,"BE",246,"Bern-Mittelland",666,"Kriechenwil","2010-01-01"]
[15201,"BE",246,"Bern-Mittelland",667,"Laupen","2010-01-01"]
[15202,"BE",246,"Bern-Mittelland",668,"Mühleberg","2010-01-01"]
[15203,"BE",246,"Bern-Mittelland",669,"Münchenwiler","2010-01-01"]
[15204,"BE",246,"Bern-Mittelland",670,"Neuenegg","2010-01-01"]
[15205,"BE",246,"Bern-Mittelland",671,"Wileroltigen","2010-01-01"]
[15206,"BE",241,"Jura bernois",681,"Belprahon","2010-01-01"]
[15208,"BE",241,"Jura bernois",683,"Champoz","2010-01-01"]
[15210,"BE",241,"Jura bernois",687,"Corcelles (BE)","2010-01-01"]
[15211,"BE",241,"Jura bernois",690,"Court","2010-01-01"]
[15212,"BE",241,"Jura bernois",691,"Crémines","2010-01-01"]
[15213,"BE",241,"Jura bernois",692,"Eschert","2010-01-01"]
[15214,"BE",241,"Jura bernois",694,"Grandval","2010-01-01"]
[15215,"BE",241,"Jura bernois",696,"Loveresse","2010-01-01"]
[15218,"BE",241,"Jura bernois",700,"Moutier","2010-01-01"]
[15219,"BE",241,"Jura bernois",701,"Perrefitte","2010-01-01"]
[15221,"BE",241,"Jura bernois",703,"Reconvilier","2010-01-01"]
[15222,"BE",241,"Jura bernois",704,"Roches (BE)","2010-01-01"]
[15223,"BE",241,"Jura bernois",706,"Saicourt","2010-01-01"]
[15224,"BE",241,"Jura bernois",707,"Saules (BE)","2010-01-01"]
[15225,"BE",241,"Jura bernois",708,"Schelten","2010-01-01"]
[15226,"BE",241,"Jura bernois",709,"Seehof","2010-01-01"]
[15228,"BE",241,"Jura bernois",711,"Sorvilier","2010-01-01"]
[15230,"BE",241,"Jura bernois",713,"Tavannes","2010-01-01"]
[15231,"BE",241,"Jura bernois",715,"Rebévelier","2010-01-01"]
[15662,"BE",241,"Jura bernois",716,"Petit-Val","2015-01-01"]
[15661,"BE",241,"Jura bernois",717,"Valbirse","2015-01-01"]
[15234,"BE",241,"Jura bernois",723,"La Neuveville","2010-01-01"]
[15235,"BE",241,"Jura bernois",724,"Nods","2010-01-01"]
[15636,"BE",241,"Jura bernois",726,"Plateau de Diesse","2014-01-01"]
[15237,"BE",242,"Biel/Bienne",731,"Aegerten","2010-01-01"]
[15238,"BE",242,"Biel/Bienne",732,"Bellmund","2010-01-01"]
[15239,"BE",242,"Biel/Bienne",733,"Brügg","2010-01-01"]
[15240,"BE",243,"Seeland",734,"Bühl","2010-01-01"]
[15241,"BE",243,"Seeland",735,"Epsach","2010-01-01"]
[15242,"BE",243,"Seeland",736,"Hagneck","2010-01-01"]
[15243,"BE",243,"Seeland",737,"Hermrigen","2010-01-01"]
[15244,"BE",243,"Seeland",738,"Jens","2010-01-01"]
[15245,"BE",242,"Biel/Bienne",739,"Ipsach","2010-01-01"]
[15246,"BE",242,"Biel/Bienne",740,"Ligerz","2010-01-01"]
[15247,"BE",243,"Seeland",741,"Merzligen","2010-01-01"]
[15248,"BE",242,"Biel/Bienne",742,"Mörigen","2010-01-01"]
[15249,"BE",242,"Biel/Bienne",743,"Nidau","2010-01-01"]
[15250,"BE",242,"Biel/Bienne",744,"Orpund","2010-01-01"]
[15251,"BE",242,"Biel/Bienne",745,"Port","2010-01-01"]
[15252,"BE",242,"Biel/Bienne",746,"Safnern","2010-01-01"]
[15253,"BE",242,"Biel/Bienne",747,"Scheuren","2010-01-01"]
[15254,"BE",242,"Biel/Bienne",748,"Schwadernau","2010-01-01"]
[15255,"BE",243,"Seeland",749,"Studen (BE)","2010-01-01"]
[15256,"BE",242,"Biel/Bienne",750,"Sutz-Lattrigen","2010-01-01"]
[15257,"BE",243,"Seeland",751,"Täuffelen","2010-01-01"]
[15258,"BE",243,"Seeland",754,"Walperswil","2010-01-01"]
[15259,"BE",243,"Seeland",755,"Worben","2010-01-01"]
[14978,"BE",242,"Biel/Bienne",756,"Twann-Tüscherz","2010-01-01"]
[15260,"BE",249,"Frutigen-Niedersimmental",761,"Därstetten","2010-01-01"]
[15261,"BE",249,"Frutigen-Niedersimmental",762,"Diemtigen","2010-01-01"]
[15262,"BE",249,"Frutigen-Niedersimmental",763,"Erlenbach im Simmental","2010-01-01"]
[15265,"BE",249,"Frutigen-Niedersimmental",766,"Oberwil im Simmental","2010-01-01"]
[15266,"BE",247,"Thun",767,"Reutigen","2010-01-01"]
[15267,"BE",249,"Frutigen-Niedersimmental",768,"Spiez","2010-01-01"]
[15268,"BE",249,"Frutigen-Niedersimmental",769,"Wimmis","2010-01-01"]
[15637,"BE",247,"Thun",770,"Stocken-Höfen","2014-01-01"]
[15270,"BE",250,"Interlaken-Oberhasli",782,"Guttannen","2010-01-01"]
[15271,"BE",250,"Interlaken-Oberhasli",783,"Hasliberg","2010-01-01"]
[15638,"BE",250,"Interlaken-Oberhasli",784,"Innertkirchen","2014-01-01"]
[15273,"BE",250,"Interlaken-Oberhasli",785,"Meiringen","2010-01-01"]
[15274,"BE",250,"Interlaken-Oberhasli",786,"Schattenhalb","2010-01-01"]
[15275,"BE",248,"Obersimmental-Saanen",791,"Boltigen","2010-01-01"]
[15276,"BE",248,"Obersimmental-Saanen",792,"Lenk","2010-01-01"]
[15277,"BE",248,"Obersimmental-Saanen",793,"St. Stephan","2010-01-01"]
[15278,"BE",248,"Obersimmental-Saanen",794,"Zweisimmen","2010-01-01"]
[15279,"BE",248,"Obersimmental-Saanen",841,"Gsteig","2010-01-01"]
[15280,"BE",248,"Obersimmental-Saanen",842,"Lauenen","2010-01-01"]
[15281,"BE",248,"Obersimmental-Saanen",843,"Saanen","2010-01-01"]
[15283,"BE",246,"Bern-Mittelland",852,"Guggisberg","2010-01-01"]
[15284,"BE",246,"Bern-Mittelland",853,"Rüschegg","2010-01-01"]
[15476,"BE",246,"Bern-Mittelland",855,"Schwarzenburg","2011-01-01"]
[15498,"BE",246,"Bern-Mittelland",861,"Belp","2012-01-01"]
[15288,"BE",247,"Thun",863,"Burgistein","2010-01-01"]
[15290,"BE",246,"Bern-Mittelland",866,"Gerzensee","2010-01-01"]
[15291,"BE",247,"Thun",867,"Gurzelen","2010-01-01"]
[15292,"BE",246,"Bern-Mittelland",868,"Jaberg","2010-01-01"]
[15293,"BE",246,"Bern-Mittelland",869,"Kaufdorf","2010-01-01"]
[15294,"BE",246,"Bern-Mittelland",870,"Kehrsatz","2010-01-01"]
[16083,"BE",246,"Bern-Mittelland",872,"Kirchdorf (BE)","2018-01-01"]
[15301,"BE",246,"Bern-Mittelland",877,"Niedermuhlern","2010-01-01"]
[16608,"BE",246,"Bern-Mittelland",879,"Riggisberg","2021-01-01"]
[15304,"BE",246,"Bern-Mittelland",880,"Rüeggisberg","2010-01-01"]
[15306,"BE",247,"Thun",883,"Seftigen","2010-01-01"]
[15307,"BE",246,"Bern-Mittelland",884,"Toffen","2010-01-01"]
[15639,"BE",247,"Thun",885,"Uttigen","2014-01-01"]
[15309,"BE",247,"Thun",886,"Wattenwil","2010-01-01"]
[15310,"BE",246,"Bern-Mittelland",888,"Wald (BE)","2010-01-01"]
[16128,"BE",246,"Bern-Mittelland",889,"Thurnen","2020-01-01"]
[15311,"BE",245,"Emmental",901,"Eggiwil","2010-01-01"]
[15312,"BE",245,"Emmental",902,"Langnau im Emmental","2010-01-01"]
[15313,"BE",245,"Emmental",903,"Lauperswil","2010-01-01"]
[15314,"BE",245,"Emmental",904,"Röthenbach im Emmental","2010-01-01"]
[15315,"BE",245,"Emmental",905,"Rüderswil","2010-01-01"]
[15316,"BE",245,"Emmental",906,"Schangnau","2010-01-01"]
[15317,"BE",245,"Emmental",907,"Signau","2010-01-01"]
[15318,"BE",245,"Emmental",908,"Trub","2010-01-01"]
[15319,"BE",245,"Emmental",909,"Trubschachen","2010-01-01"]
[15320,"BE",247,"Thun",921,"Amsoldingen","2010-01-01"]
[15321,"BE",247,"Thun",922,"Blumenstein","2010-01-01"]
[15322,"BE",247,"Thun",923,"Buchholterberg","2010-01-01"]
[15323,"BE",247,"Thun",924,"Eriz","2010-01-01"]
[15324,"BE",247,"Thun",925,"Fahrni","2010-01-01"]
[15325,"BE",247,"Thun",927,"Heiligenschwendi","2010-01-01"]
[15326,"BE",247,"Thun",928,"Heimberg","2010-01-01"]
[15327,"BE",247,"Thun",929,"Hilterfingen","2010-01-01"]
[15329,"BE",247,"Thun",931,"Homberg","2010-01-01"]
[15330,"BE",247,"Thun",932,"Horrenbach-Buchen","2010-01-01"]
[15331,"BE",247,"Thun",934,"Oberhofen am Thunersee","2010-01-01"]
[15332,"BE",247,"Thun",935,"Oberlangenegg","2010-01-01"]
[15333,"BE",247,"Thun",936,"Pohlern","2010-01-01"]
[15335,"BE",247,"Thun",938,"Sigriswil","2010-01-01"]
[16129,"BE",247,"Thun",939,"Steffisburg","2020-01-01"]
[15337,"BE",247,"Thun",940,"Teuffenthal (BE)","2010-01-01"]
[15338,"BE",247,"Thun",941,"Thierachern","2010-01-01"]
[15339,"BE",247,"Thun",942,"Thun","2010-01-01"]
[15340,"BE",247,"Thun",943,"Uebeschi","2010-01-01"]
[15341,"BE",247,"Thun",944,"Uetendorf","2010-01-01"]
[15342,"BE",247,"Thun",945,"Unterlangenegg","2010-01-01"]
[15343,"BE",247,"Thun",946,"Wachseldorn","2010-01-01"]
[15344,"BE",247,"Thun",947,"Zwieselberg","2010-01-01"]
[15345,"BE",247,"Thun",948,"Forst-Längenbühl","2010-01-01"]
[15346,"BE",245,"Emmental",951,"Affoltern im Emmental","2010-01-01"]
[15347,"BE",245,"Emmental",952,"Dürrenroth","2010-01-01"]
[15348,"BE",244,"Oberaargau",953,"Eriswil","2010-01-01"]
[15349,"BE",244,"Oberaargau",954,"Huttwil","2010-01-01"]
[15350,"BE",245,"Emmental",955,"Lützelflüh","2010-01-01"]
[15351,"BE",245,"Emmental",956,"Rüegsau","2010-01-01"]
[15352,"BE",245,"Emmental",957,"Sumiswald","2010-01-01"]
[15353,"BE",245,"Emmental",958,"Trachselwald","2010-01-01"]
[15354,"BE",244,"Oberaargau",959,"Walterswil (BE)","2010-01-01"]
[15355,"BE",244,"Oberaargau",960,"Wyssachen","2010-01-01"]
[15356,"BE",244,"Oberaargau",971,"Attiswil","2010-01-01"]
[15357,"BE",244,"Oberaargau",972,"Berken","2010-01-01"]
[15477,"BE",244,"Oberaargau",973,"Bettenhausen","2011-01-01"]
[15360,"BE",244,"Oberaargau",975,"Farnern","2010-01-01"]
[15361,"BE",244,"Oberaargau",976,"Graben","2010-01-01"]
[15362,"BE",244,"Oberaargau",977,"Heimenhausen","2010-01-01"]
[15364,"BE",244,"Oberaargau",979,"Herzogenbuchsee","2010-01-01"]
[15365,"BE",244,"Oberaargau",980,"Inkwil","2010-01-01"]
[16130,"BE",244,"Oberaargau",981,"Niederbipp","2020-01-01"]
[15367,"BE",244,"Oberaargau",982,"Niederönz","2010-01-01"]
[15368,"BE",244,"Oberaargau",983,"Oberbipp","2010-01-01"]
[15369,"BE",244,"Oberaargau",985,"Ochlenberg","2010-01-01"]
[15370,"BE",244,"Oberaargau",987,"Rumisberg","2010-01-01"]
[15674,"BE",244,"Oberaargau",988,"Seeberg","2016-01-01"]
[15372,"BE",244,"Oberaargau",989,"Thörigen","2010-01-01"]
[15373,"BE",244,"Oberaargau",990,"Walliswil bei Niederbipp","2010-01-01"]
[15374,"BE",244,"Oberaargau",991,"Walliswil bei Wangen","2010-01-01"]
[15375,"BE",244,"Oberaargau",992,"Wangen an der Aare","2010-01-01"]
[15376,"BE",244,"Oberaargau",993,"Wangenried","2010-01-01"]
[15377,"BE",244,"Oberaargau",995,"Wiedlisbach","2010-01-01"]
[15557,"LU",316,"Entlebuch",1001,"Doppleschwand","2013-01-01"]
[15561,"LU",316,"Entlebuch",1002,"Entlebuch","2013-01-01"]
[15543,"LU",316,"Entlebuch",1004,"Flühli","2013-01-01"]
[15547,"LU",316,"Entlebuch",1005,"Hasle (LU)","2013-01-01"]
[15582,"LU",316,"Entlebuch",1007,"Romoos","2013-01-01"]
[15585,"LU",316,"Entlebuch",1008,"Schüpfheim","2013-01-01"]
[15522,"LU",316,"Entlebuch",1009,"Werthenstein","2013-01-01"]
[15518,"LU",316,"Entlebuch",1010,"Escholzmatt-Marbach","2013-01-01"]
[15539,"LU",313,"Hochdorf",1021,"Aesch (LU)","2013-01-01"]
[15536,"LU",313,"Hochdorf",1023,"Ballwil","2013-01-01"]
[15563,"LU",313,"Hochdorf",1024,"Emmen","2013-01-01"]
[15564,"LU",313,"Hochdorf",1025,"Ermensee","2013-01-01"]
[15560,"LU",313,"Hochdorf",1026,"Eschenbach (LU)","2013-01-01"]
[16590,"LU",313,"Hochdorf",1030,"Hitzkirch","2021-01-01"]
[15556,"LU",313,"Hochdorf",1031,"Hochdorf","2013-01-01"]
[15597,"LU",313,"Hochdorf",1032,"Hohenrain","2013-01-01"]
[15574,"LU",313,"Hochdorf",1033,"Inwil","2013-01-01"]
[15590,"LU",313,"Hochdorf",1037,"Rain","2013-01-01"]
[15592,"LU",313,"Hochdorf",1039,"Römerswil","2013-01-01"]
[15579,"LU",313,"Hochdorf",1040,"Rothenburg","2013-01-01"]
[15586,"LU",313,"Hochdorf",1041,"Schongau","2013-01-01"]
[15538,"LU",312,"Luzern-Land",1051,"Adligenswil","2013-01-01"]
[15532,"LU",312,"Luzern-Land",1052,"Buchrain","2013-01-01"]
[15535,"LU",312,"Luzern-Land",1053,"Dierikon","2013-01-01"]
[15552,"LU",312,"Luzern-Land",1054,"Ebikon","2013-01-01"]
[15550,"LU",312,"Luzern-Land",1055,"Gisikon","2013-01-01"]
[15551,"LU",312,"Luzern-Land",1056,"Greppen","2013-01-01"]
[15558,"LU",312,"Luzern-Land",1057,"Honau","2013-01-01"]
[15559,"LU",312,"Luzern-Land",1058,"Horw","2013-01-01"]
[15576,"LU",312,"Luzern-Land",1059,"Kriens","2013-01-01"]
[15600,"LU",311,"Luzern-Stadt",1061,"Luzern","2013-01-01"]
[15578,"LU",312,"Luzern-Land",1062,"Malters","2013-01-01"]
[15568,"LU",312,"Luzern-Land",1063,"Meggen","2013-01-01"]
[15567,"LU",312,"Luzern-Land",1064,"Meierskappel","2013-01-01"]
[15581,"LU",312,"Luzern-Land",1065,"Root","2013-01-01"]
[15584,"LU",312,"Luzern-Land",1066,"Schwarzenberg","2013-01-01"]
[15530,"LU",312,"Luzern-Land",1067,"Udligenswil","2013-01-01"]
[15526,"LU",312,"Luzern-Land",1068,"Vitznau","2013-01-01"]
[15528,"LU",312,"Luzern-Land",1069,"Weggis","2013-01-01"]
[15663,"LU",314,"Sursee",1081,"Beromünster","2015-01-01"]
[15534,"LU",314,"Sursee",1082,"Büron","2013-01-01"]
[15533,"LU",314,"Sursee",1083,"Buttisholz","2013-01-01"]
[15554,"LU",314,"Sursee",1084,"Eich","2013-01-01"]
[15548,"LU",314,"Sursee",1085,"Geuensee","2013-01-01"]
[15545,"LU",314,"Sursee",1086,"Grosswangen","2013-01-01"]
[15562,"LU",314,"Sursee",1088,"Hildisrieden","2013-01-01"]
[15575,"LU",314,"Sursee",1089,"Knutwil","2013-01-01"]
[15573,"LU",314,"Sursee",1091,"Mauensee","2013-01-01"]
[15570,"LU",314,"Sursee",1093,"Neuenkirch","2013-01-01"]
[15572,"LU",314,"Sursee",1094,"Nottwil","2013-01-01"]
[15569,"LU",314,"Sursee",1095,"Oberkirch","2013-01-01"]
[15520,"LU",314,"Sursee",1097,"Rickenbach (LU)","2013-01-01"]
[15580,"LU",314,"Sursee",1098,"Ruswil","2013-01-01"]
[15664,"LU",314,"Sursee",1099,"Schenkon","2015-01-01"]
[15588,"LU",314,"Sursee",1100,"Schlierbach","2013-01-01"]
[15587,"LU",314,"Sursee",1102,"Sempach","2013-01-01"]
[15529,"LU",314,"Sursee",1103,"Sursee","2013-01-01"]
[15599,"LU",314,"Sursee",1104,"Triengen","2013-01-01"]
[15525,"LU",316,"Entlebuch",1107,"Wolhusen","2013-01-01"]
[15537,"LU",315,"Willisau",1121,"Alberswil","2013-01-01"]
[15540,"LU",315,"Willisau",1122,"Altbüron","2013-01-01"]
[16131,"LU",315,"Willisau",1123,"Altishofen","2020-01-01"]
[15593,"LU",315,"Willisau",1125,"Dagmersellen","2013-01-01"]
[15555,"LU",315,"Willisau",1127,"Egolzwil","2013-01-01"]
[15594,"LU",315,"Willisau",1128,"Ettiswil","2013-01-01"]
[15546,"LU",315,"Willisau",1129,"Fischbach","2013-01-01"]
[15544,"LU",315,"Willisau",1131,"Grossdietwil","2013-01-01"]
[15565,"LU",315,"Willisau",1132,"Hergiswil bei Willisau","2013-01-01"]
[15577,"LU",315,"Willisau",1135,"Luthern","2013-01-01"]
[15566,"LU",315,"Willisau",1136,"Menznau","2013-01-01"]
[15571,"LU",315,"Willisau",1137,"Nebikon","2013-01-01"]
[15591,"LU",315,"Willisau",1139,"Pfaffnau","2013-01-01"]
[15596,"LU",315,"Willisau",1140,"Reiden","2013-01-01"]
[15583,"LU",315,"Willisau",1142,"Roggliswil","2013-01-01"]
[15521,"LU",315,"Willisau",1143,"Schötz","2013-01-01"]
[15531,"LU",315,"Willisau",1145,"Ufhusen","2013-01-01"]
[15527,"LU",315,"Willisau",1146,"Wauwil","2013-01-01"]
[15523,"LU",315,"Willisau",1147,"Wikon","2013-01-01"]
[15524,"LU",315,"Willisau",1150,"Zell (LU)","2013-01-01"]
[16591,"LU",315,"Willisau",1151,"Willisau","2021-01-01"]
[11773,"UR",400,"Kt. Uri",1201,"Altdorf (UR)","1848-09-12"]
[11784,"UR",400,"Kt. Uri",1202,"Andermatt","1848-09-12"]
[11678,"UR",400,"Kt. Uri",1203,"Attinghausen","1848-09-12"]
[11506,"UR",400,"Kt. Uri",1205,"Bürglen (UR)","1848-09-12"]
[12238,"UR",400,"Kt. Uri",1206,"Erstfeld","1848-09-12"]
[11940,"UR",400,"Kt. Uri",1207,"Flüelen","1848-09-12"]
[12032,"UR",400,"Kt. Uri",1208,"Göschenen","1875-01-01"]
[11941,"UR",400,"Kt. Uri",1209,"Gurtnellen","1848-09-12"]
[12213,"UR",400,"Kt. Uri",1210,"Hospental","1848-09-12"]
[12661,"UR",400,"Kt. Uri",1211,"Isenthal","1848-09-12"]
[13165,"UR",400,"Kt. Uri",1212,"Realp","1848-09-12"]
[13055,"UR",400,"Kt. Uri",1213,"Schattdorf","1848-09-12"]
[16592,"UR",400,"Kt. Uri",1214,"Seedorf (UR)","2021-01-01"]
[12950,"UR",400,"Kt. Uri",1215,"Seelisberg","1848-09-12"]
[12985,"UR",400,"Kt. Uri",1216,"Silenen","1848-09-12"]
[12981,"UR",400,"Kt. Uri",1217,"Sisikon","1848-09-12"]
[10364,"UR",400,"Kt. Uri",1218,"Spiringen","1848-09-12"]
[10869,"UR",400,"Kt. Uri",1219,"Unterschächen","1848-09-12"]
[10442,"UR",400,"Kt. Uri",1220,"Wassen","1875-01-01"]
[12152,"SZ",501,"Einsiedeln",1301,"Einsiedeln","1848-09-12"]
[12033,"SZ",502,"Gersau",1311,"Gersau","1848-09-12"]
[12007,"SZ",503,"Höfe",1321,"Feusisberg","1848-09-12"]
[11961,"SZ",503,"Höfe",1322,"Freienbach","1848-09-12"]
[10314,"SZ",503,"Höfe",1323,"Wollerau","1848-09-12"]
[14470,"SZ",504,"Küssnacht (SZ)",1331,"Küssnacht (SZ)","2004-01-01"]
[11774,"SZ",505,"March",1341,"Altendorf","1848-09-12"]
[12075,"SZ",505,"March",1342,"Galgenen","1848-09-12"]
[12658,"SZ",505,"March",1343,"Innerthal","1848-09-12"]
[12607,"SZ",505,"March",1344,"Lachen","1848-09-12"]
[13181,"SZ",505,"March",1345,"Reichenburg","1848-09-12"]
[12968,"SZ",505,"March",1346,"Schübelbach","1848-09-12"]
[10859,"SZ",505,"March",1347,"Tuggen","1848-09-12"]
[10371,"SZ",505,"March",1348,"Vorderthal","1848-09-12"]
[10471,"SZ",505,"March",1349,"Wangen (SZ)","1848-09-12"]
[11778,"SZ",506,"Schwyz",1361,"Alpthal","1848-09-12"]
[11670,"SZ",506,"Schwyz",1362,"Arth","1848-09-12"]
[12192,"SZ",506,"Schwyz",1363,"Illgau","1848-09-12"]
[12657,"SZ",506,"Schwyz",1364,"Ingenbohl","1848-09-12"]
[12634,"SZ",506,"Schwyz",1365,"Lauerz","1848-09-12"]
[12371,"SZ",506,"Schwyz",1366,"Morschach","1848-09-12"]
[12362,"SZ",506,"Schwyz",1367,"Muotathal","1848-09-12"]
[12475,"SZ",506,"Schwyz",1368,"Oberiberg","1884-01-01"]
[12894,"SZ",506,"Schwyz",1369,"Riemenstalden","1848-09-12"]
[12853,"SZ",506,"Schwyz",1370,"Rothenthurm","1848-09-12"]
[13022,"SZ",506,"Schwyz",1371,"Sattel","1848-09-12"]
[12955,"SZ",506,"Schwyz",1372,"Schwyz","1848-09-12"]
[10594,"SZ",506,"Schwyz",1373,"Steinen","1848-09-12"]
[10571,"SZ",506,"Schwyz",1374,"Steinerberg","1848-09-12"]
[10865,"SZ",506,"Schwyz",1375,"Unteriberg","1884-01-01"]
[11753,"OW",600,"Kt. Obwalden",1401,"Alpnach","1848-09-12"]
[12287,"OW",600,"Kt. Obwalden",1402,"Engelberg","1848-09-12"]
[12063,"OW",600,"Kt. Obwalden",1403,"Giswil","1848-09-12"]
[12688,"OW",600,"Kt. Obwalden",1404,"Kerns","1848-09-12"]
[12718,"OW",600,"Kt. Obwalden",1405,"Lungern","1848-09-12"]
[12859,"OW",600,"Kt. Obwalden",1406,"Sachseln","1848-09-12"]
[13009,"OW",600,"Kt. Obwalden",1407,"Sarnen","1848-09-12"]
[11792,"NW",700,"Kt. Nidwalden",1501,"Beckenried","1850-01-01"]
[11465,"NW",700,"Kt. Nidwalden",1502,"Buochs","1850-01-01"]
[11568,"NW",700,"Kt. Nidwalden",1503,"Dallenwil","1850-01-01"]
[12290,"NW",700,"Kt. Nidwalden",1504,"Emmetten","1850-01-01"]
[12276,"NW",700,"Kt. Nidwalden",1505,"Ennetbürgen","1850-01-01"]
[12275,"NW",700,"Kt. Nidwalden",1506,"Ennetmoos","1850-01-01"]
[12300,"NW",700,"Kt. Nidwalden",1507,"Hergiswil (NW)","1850-01-01"]
[12556,"NW",700,"Kt. Nidwalden",1508,"Oberdorf (NW)","1850-01-01"]
[10576,"NW",700,"Kt. Nidwalden",1509,"Stans","1850-01-01"]
[10577,"NW",700,"Kt. Nidwalden",1510,"Stansstad","1850-01-01"]
[10357,"NW",700,"Kt. Nidwalden",1511,"Wolfenschiessen","1850-01-01"]
[15479,"GL",800,"Kt. Glarus",1630,"Glarus Nord","2011-01-01"]
[15478,"GL",800,"Kt. Glarus",1631,"Glarus Süd","2011-01-01"]
[15480,"GL",800,"Kt. Glarus",1632,"Glarus","2011-01-01"]
[11711,"ZG",900,"Kt. Zug",1701,"Baar","1848-09-12"]
[11397,"ZG",900,"Kt. Zug",1702,"Cham","1848-09-12"]
[12176,"ZG",900,"Kt. Zug",1703,"Hünenberg","1848-09-12"]
[12389,"ZG",900,"Kt. Zug",1704,"Menzingen","1848-09-12"]
[12517,"ZG",900,"Kt. Zug",1705,"Neuheim","1848-09-12"]
[12551,"ZG",900,"Kt. Zug",1706,"Oberägeri","1848-09-12"]
[12931,"ZG",900,"Kt. Zug",1707,"Risch","1848-09-12"]
[10598,"ZG",900,"Kt. Zug",1708,"Steinhausen","1848-09-12"]
[10844,"ZG",900,"Kt. Zug",1709,"Unterägeri","1848-09-12"]
[10457,"ZG",900,"Kt. Zug",1710,"Walchwil","1848-09-12"]
[10323,"ZG",900,"Kt. Zug",1711,"Zug","1848-09-12"]
[11419,"FR",1001,"La Broye",2008,"Châtillon (FR)","1848-09-12"]
[14510,"FR",1001,"La Broye",2011,"Cugy (FR)","2005-01-01"]
[11974,"FR",1001,"La Broye",2016,"Fétigny","1848-09-12"]
[12055,"FR",1001,"La Broye",2022,"Gletterens","1848-09-12"]
[14526,"FR",1001,"La Broye",2025,"Lully (FR)","2006-01-01"]
[12387,"FR",1001,"La Broye",2027,"Ménières","1848-09-12"]
[14475,"FR",1001,"La Broye",2029,"Montagny (FR)","2004-01-01"]
[12549,"FR",1001,"La Broye",2035,"Nuvilly","1848-09-12"]
[13105,"FR",1001,"La Broye",2038,"Prévondavaux","1848-09-12"]
[13702,"FR",1001,"La Broye",2041,"Saint-Aubin (FR)","1991-01-01"]
[12991,"FR",1001,"La Broye",2043,"Sévaz","1848-09-12"]
[16593,"FR",1001,"La Broye",2044,"Surpierre","2021-01-01"]
[10944,"FR",1001,"La Broye",2045,"Vallon","1848-09-12"]
[14474,"FR",1001,"La Broye",2050,"Les Montets","2004-01-01"]
[14511,"FR",1001,"La Broye",2051,"Delley-Portalban","2005-01-01"]
[15675,"FR",1001,"La Broye",2053,"Belmont-Broye","2016-01-01"]
[15689,"FR",1001,"La Broye",2054,"Estavayer","2017-01-01"]
[15690,"FR",1001,"La Broye",2055,"Cheyres-Châbles","2017-01-01"]
[11680,"FR",1002,"La Glâne",2061,"Auboranges","1848-09-12"]
[14103,"FR",1002,"La Glâne",2063,"Billens-Hennens","1998-01-01"]
[11444,"FR",1002,"La Glâne",2066,"Chapelle (Glâne)","1953-01-01"]
[12611,"FR",1002,"La Glâne",2067,"Le Châtelard","1848-09-12"]
[11420,"FR",1002,"La Glâne",2068,"Châtonnaye","1848-09-12"]
[13211,"FR",1002,"La Glâne",2072,"Ecublens (FR)","1969-03-01"]
[12113,"FR",1002,"La Glâne",2079,"Grangettes","1848-09-12"]
[12734,"FR",1002,"La Glâne",2086,"Massonnens","1848-09-12"]
[14476,"FR",1002,"La Glâne",2087,"Mézières (FR)","2004-01-01"]
[12340,"FR",1002,"La Glâne",2089,"Montet (Glâne)","1848-09-12"]
[13663,"FR",1002,"La Glâne",2096,"Romont (FR)","1981-01-01"]
[14140,"FR",1002,"La Glâne",2097,"Rue","2001-01-01"]
[14477,"FR",1002,"La Glâne",2099,"Siviriez","2004-01-01"]
[15500,"FR",1002,"La Glâne",2102,"Ursy","2012-01-01"]
[14480,"FR",1002,"La Glâne",2113,"Vuisternens-devant-Romont","2004-01-01"]
[14137,"FR",1002,"La Glâne",2114,"Villorsonnens","2001-01-01"]
[14478,"FR",1002,"La Glâne",2115,"Torny","2004-01-01"]
[16132,"FR",1002,"La Glâne",2117,"Villaz","2020-01-01"]
[14362,"FR",1003,"La Gruyère",2121,"Haut-Intyamon","2002-01-01"]
[14368,"FR",1003,"La Gruyère",2122,"Pont-en-Ogoz","2003-01-01"]
[14530,"FR",1003,"La Gruyère",2123,"Botterens","2006-01-01"]
[11871,"FR",1003,"La Gruyère",2124,"Broc","1848-09-12"]
[14528,"FR",1003,"La Gruyère",2125,"Bulle","2006-01-01"]
[11424,"FR",1003,"La Gruyère",2128,"Châtel-sur-Montsalvens","1848-09-12"]
[15481,"FR",1003,"La Gruyère",2129,"Corbières","2011-01-01"]
[11533,"FR",1003,"La Gruyère",2130,"Crésuz","1848-09-12"]
[12135,"FR",1003,"La Gruyère",2131,"Echarlens","1848-09-12"]
[12106,"FR",1003,"La Gruyère",2134,"Grandvillard","1848-09-12"]
[11958,"FR",1003,"La Gruyère",2135,"Gruyères","1848-09-12"]
[12247,"FR",1003,"La Gruyère",2137,"Hauteville","1848-09-12"]
[12668,"FR",1003,"La Gruyère",2138,"Jaun","1848-09-12"]
[14135,"FR",1003,"La Gruyère",2140,"Marsens","2001-01-01"]
[12369,"FR",1003,"La Gruyère",2143,"Morlon","1848-09-12"]
[12618,"FR",1003,"La Gruyère",2145,"Le Pâquier (FR)","1848-09-12"]
[13080,"FR",1003,"La Gruyère",2147,"Pont-la-Ville","1848-09-12"]
[12909,"FR",1003,"La Gruyère",2148,"Riaz","1848-09-12"]
[12574,"FR",1003,"La Gruyère",2149,"La Roche","1848-09-12"]
[14138,"FR",1003,"La Gruyère",2152,"Sâles","2001-01-01"]
[10416,"FR",1003,"La Gruyère",2153,"Sorens","1848-09-12"]
[10906,"FR",1003,"La Gruyère",2155,"Vaulruz","1848-09-12"]
[10373,"FR",1003,"La Gruyère",2160,"Vuadens","1848-09-12"]
[14479,"FR",1003,"La Gruyère",2162,"Bas-Intyamon","2004-01-01"]
[15640,"FR",1003,"La Gruyère",2163,"Val-de-Charmey","2014-01-01"]
[11657,"FR",1004,"La Sarine",2173,"Autigny","1848-09-12"]
[14143,"FR",1004,"La Sarine",2174,"Avry","2001-01-01"]
[15676,"FR",1004,"La Sarine",2175,"Belfaux","2016-01-01"]
[11502,"FR",1004,"La Sarine",2177,"Chénens","1848-09-12"]
[15692,"FR",1004,"La Sarine",2183,"Corminboeuf","2017-01-01"]
[11540,"FR",1004,"La Sarine",2186,"Cottens (FR)","1848-09-12"]
[11978,"FR",1004,"La Sarine",2194,"Ferpicloz","1848-09-12"]
[11954,"FR",1004,"La Sarine",2196,"Fribourg","1848-09-12"]
[12060,"FR",1004,"La Sarine",2197,"Givisiez","1848-09-12"]
[12111,"FR",1004,"La Sarine",2198,"Granges-Paccot","1848-09-12"]
[14129,"FR",1004,"La Sarine",2200,"Grolley","2000-01-01"]
[13249,"FR",1004,"La Sarine",2206,"Marly","1976-01-01"]
[12744,"FR",1004,"La Sarine",2208,"Matran","1848-09-12"]
[12521,"FR",1004,"La Sarine",2211,"Neyruz (FR)","1848-09-12"]
[13141,"FR",1004,"La Sarine",2216,"Pierrafortscha","1848-09-12"]
[13662,"FR",1004,"La Sarine",2217,"Ponthaux","1981-01-01"]
[14369,"FR",1004,"La Sarine",2220,"Le Mouret","2003-01-01"]
[10889,"FR",1004,"La Sarine",2226,"Treyvaux","1848-09-12"]
[10162,"FR",1004,"La Sarine",2228,"Villars-sur-Glâne","1848-09-12"]
[10165,"FR",1004,"La Sarine",2230,"Villarsel-sur-Marly","1848-09-12"]
[14141,"FR",1004,"La Sarine",2233,"Hauterive (FR)","2001-01-01"]
[14136,"FR",1004,"La Sarine",2234,"La Brillaz","2001-01-01"]
[14481,"FR",1004,"La Sarine",2235,"La Sonnaz","2004-01-01"]
[15677,"FR",1004,"La Sarine",2236,"Gibloux","2016-01-01"]
[16133,"FR",1004,"La Sarine",2237,"Prez","2020-01-01"]
[16594,"FR",1004,"La Sarine",2238,"Bois-d'Amont","2021-01-01"]
[11534,"FR",1005,"See / Lac",2250,"Courgevaux","1848-09-12"]
[15693,"FR",1005,"See / Lac",2254,"Courtepin","2017-01-01"]
[11522,"FR",1005,"See / Lac",2257,"Cressier (FR)","1848-09-12"]
[11969,"FR",1005,"See / Lac",2258,"Fräschels","1848-09-12"]
[12107,"FR",1005,"See / Lac",2259,"Galmiz","1848-09-12"]
[12102,"FR",1005,"See / Lac",2260,"Gempenach","1848-09-12"]
[12078,"FR",1005,"See / Lac",2261,"Greng","1848-09-12"]
[14514,"FR",1005,"See / Lac",2262,"Gurmels","2005-01-01"]
[12689,"FR",1005,"See / Lac",2265,"Kerzers","1848-09-12"]
[12700,"FR",1005,"See / Lac",2266,"Kleinbösingen","1848-09-12"]
[12437,"FR",1005,"See / Lac",2271,"Meyriez","1848-09-12"]
[14096,"FR",1005,"See / Lac",2272,"Misery-Courtion","1997-01-01"]
[12361,"FR",1005,"See / Lac",2274,"Muntelier","1848-09-12"]
[15678,"FR",1005,"See / Lac",2275,"Murten","2016-01-01"]
[14529,"FR",1005,"See / Lac",2276,"Ried bei Kerzers","2006-01-01"]
[10856,"FR",1005,"See / Lac",2278,"Ulmiz","1848-09-12"]
[15679,"FR",1005,"See / Lac",2284,"Mont-Vully","2016-01-01"]
[11473,"FR",1006,"Sense",2292,"Brünisried","1848-09-12"]
[12204,"FR",1006,"Sense",2293,"Düdingen","1922-01-01"]
[12024,"FR",1006,"Sense",2294,"Giffers","1848-09-12"]
[13193,"FR",1006,"Sense",2295,"Bösingen","1962-01-01"]
[12260,"FR",1006,"Sense",2296,"Heitenried","1848-09-12"]
[15694,"FR",1006,"Sense",2299,"Plaffeien","2017-01-01"]
[13218,"FR",1006,"Sense",2300,"Plasselb","1971-01-01"]
[13175,"FR",1006,"Sense",2301,"Rechthalten","1848-09-12"]
[10378,"FR",1006,"Sense",2303,"St. Silvester","1848-09-12"]
[10380,"FR",1006,"Sense",2304,"St. Ursen","1848-09-12"]
[13041,"FR",1006,"Sense",2305,"Schmitten (FR)","1922-01-01"]
[16595,"FR",1006,"Sense",2306,"Tafers","2021-01-01"]
[10559,"FR",1006,"Sense",2307,"Tentlingen","1848-09-12"]
[10848,"FR",1006,"Sense",2308,"Ueberstorf","1848-09-12"]
[13232,"FR",1006,"Sense",2309,"Wünnewil-Flamatt","1974-01-01"]
[11676,"FR",1007,"La Veveyse",2321,"Attalens","1848-09-12"]
[11799,"FR",1007,"La Veveyse",2323,"Bossonnens","1848-09-12"]
[11426,"FR",1007,"La Veveyse",2325,"Châtel-Saint-Denis","1848-09-12"]
[12120,"FR",1007,"La Veveyse",2328,"Granges (Veveyse)","1848-09-12"]
[13172,"FR",1007,"La Veveyse",2333,"Remaufens","1848-09-12"]
[14484,"FR",1007,"La Veveyse",2335,"Saint-Martin (FR)","2004-01-01"]
[13207,"FR",1007,"La Veveyse",2336,"Semsales","1968-01-01"]
[14482,"FR",1007,"La Veveyse",2337,"Le Flon","2004-01-01"]
[14483,"FR",1007,"La Veveyse",2338,"La Verrerie","2004-01-01"]
[13703,"SO",1101,"Gäu",2401,"Egerkingen","1991-01-01"]
[13704,"SO",1101,"Gäu",2402,"Härkingen","1991-01-01"]
[13705,"SO",1101,"Gäu",2403,"Kestenholz","1991-01-01"]
[13706,"SO",1101,"Gäu",2404,"Neuendorf","1991-01-01"]
[13707,"SO",1101,"Gäu",2405,"Niederbuchsiten","1991-01-01"]
[13708,"SO",1101,"Gäu",2406,"Oberbuchsiten","1991-01-01"]
[13709,"SO",1101,"Gäu",2407,"Oensingen","1991-01-01"]
[13710,"SO",1101,"Gäu",2408,"Wolfwil","1991-01-01"]
[13711,"SO",1102,"Thal",2421,"Aedermannsdorf","1991-01-01"]
[13712,"SO",1102,"Thal",2422,"Balsthal","1991-01-01"]
[13714,"SO",1102,"Thal",2424,"Herbetswil","1991-01-01"]
[13715,"SO",1102,"Thal",2425,"Holderbank (SO)","1991-01-01"]
[13716,"SO",1102,"Thal",2426,"Laupersdorf","1991-01-01"]
[13717,"SO",1102,"Thal",2427,"Matzendorf","1991-01-01"]
[13718,"SO",1102,"Thal",2428,"Mümliswil-Ramiswil","1991-01-01"]
[16596,"SO",1102,"Thal",2430,"Welschenrohr-Gänsbrunnen","2021-01-01"]
[11911,"SO",1103,"Bucheggberg",2445,"Biezwil","1848-09-12"]
[13187,"SO",1103,"Bucheggberg",2455,"Lüterkofen-Ichertswil","1961-01-01"]
[14067,"SO",1103,"Bucheggberg",2456,"Lüterswil-Gächliwil","1995-01-01"]
[15380,"SO",1103,"Bucheggberg",2457,"Messen","2010-01-01"]
[13039,"SO",1103,"Bucheggberg",2461,"Schnottwil","1848-09-12"]
[10868,"SO",1103,"Bucheggberg",2463,"Unterramsern","1848-09-12"]
[15602,"SO",1103,"Bucheggberg",2464,"Lüsslingen-Nennigkofen","2013-01-01"]
[15642,"SO",1103,"Bucheggberg",2465,"Buchegg","2014-01-01"]
[11696,"SO",1104,"Dorneck",2471,"Bättwil","1848-09-12"]
[11510,"SO",1104,"Dorneck",2472,"Büren (SO)","1848-09-12"]
[12219,"SO",1104,"Dorneck",2473,"Dornach","1848-09-12"]
[12103,"SO",1104,"Dorneck",2474,"Gempen","1848-09-12"]
[12134,"SO",1104,"Dorneck",2475,"Hochwald","1848-09-12"]
[13684,"SO",1104,"Dorneck",2476,"Hofstetten-Flüh","1986-01-01"]
[14469,"SO",1104,"Dorneck",2477,"Metzerlen-Mariastein","2004-01-01"]
[12545,"SO",1104,"Dorneck",2478,"Nuglar-St. Pantaleon","1848-09-12"]
[12940,"SO",1104,"Dorneck",2479,"Rodersdorf","1848-09-12"]
[12990,"SO",1104,"Dorneck",2480,"Seewen","1848-09-12"]
[10352,"SO",1104,"Dorneck",2481,"Witterswil","1848-09-12"]
[11985,"SO",1105,"Gösgen",2491,"Hauenstein-Ifenthal","1848-09-12"]
[12691,"SO",1105,"Gösgen",2492,"Kienberg","1848-09-12"]
[12808,"SO",1105,"Gösgen",2493,"Lostorf","1848-09-12"]
[12559,"SO",1105,"Gösgen",2495,"Niedergösgen","1848-09-12"]
[12462,"SO",1105,"Gösgen",2497,"Obergösgen","1848-09-12"]
[16597,"SO",1105,"Gösgen",2499,"Stüsslingen","2021-01-01"]
[10894,"SO",1105,"Gösgen",2500,"Trimbach","1848-09-12"]
[10348,"SO",1105,"Gösgen",2501,"Winznau","1848-09-12"]
[10349,"SO",1105,"Gösgen",2502,"Wisen (SO)","1848-09-12"]
[14531,"SO",1105,"Gösgen",2503,"Erlinsbach (SO)","2006-01-01"]
[15508,"SO",1106,"Wasseramt",2511,"Aeschi (SO)","2012-01-01"]
[13722,"SO",1106,"Wasseramt",2513,"Biberist","1991-01-01"]
[13723,"SO",1106,"Wasseramt",2514,"Bolken","1991-01-01"]
[13725,"SO",1106,"Wasseramt",2516,"Deitingen","1991-01-01"]
[13726,"SO",1106,"Wasseramt",2517,"Derendingen","1991-01-01"]
[13727,"SO",1106,"Wasseramt",2518,"Etziken","1991-01-01"]
[13728,"SO",1106,"Wasseramt",2519,"Gerlafingen","1991-01-01"]
[13729,"SO",1106,"Wasseramt",2520,"Halten","1991-01-01"]
[13732,"SO",1106,"Wasseramt",2523,"Horriwil","1991-01-01"]
[13733,"SO",1106,"Wasseramt",2524,"Hüniken","1991-01-01"]
[13734,"SO",1106,"Wasseramt",2525,"Kriegstetten","1991-01-01"]
[13752,"SO",1106,"Wasseramt",2526,"Lohn-Ammannsegg","1993-01-01"]
[13736,"SO",1106,"Wasseramt",2527,"Luterbach","1991-01-01"]
[13737,"SO",1106,"Wasseramt",2528,"Obergerlafingen","1991-01-01"]
[13738,"SO",1106,"Wasseramt",2529,"Oekingen","1991-01-01"]
[13739,"SO",1106,"Wasseramt",2530,"Recherswil","1991-01-01"]
[13741,"SO",1106,"Wasseramt",2532,"Subingen","1991-01-01"]
[13743,"SO",1106,"Wasseramt",2534,"Zuchwil","1991-01-01"]
[15603,"SO",1106,"Wasseramt",2535,"Drei Höfe","2013-01-01"]
[11702,"SO",1107,"Lebern",2541,"Balm bei Günsberg","1848-09-12"]
[11878,"SO",1107,"Lebern",2542,"Bellach","1848-09-12"]
[11908,"SO",1107,"Lebern",2543,"Bettlach","1848-09-12"]
[11986,"SO",1107,"Lebern",2544,"Feldbrunnen-St. Niklaus","1848-09-12"]
[11937,"SO",1107,"Lebern",2545,"Flumenthal","1848-09-12"]
[12076,"SO",1107,"Lebern",2546,"Grenchen","1848-09-12"]
[11923,"SO",1107,"Lebern",2547,"Günsberg","1848-09-12"]
[12215,"SO",1107,"Lebern",2548,"Hubersdorf","1848-09-12"]
[12650,"SO",1107,"Lebern",2549,"Kammersrohr","1848-09-12"]
[12626,"SO",1107,"Lebern",2550,"Langendorf","1848-09-12"]
[12803,"SO",1107,"Lebern",2551,"Lommiswil","1848-09-12"]
[12502,"SO",1107,"Lebern",2553,"Oberdorf (SO)","1848-09-12"]
[15482,"SO",1107,"Lebern",2554,"Riedholz","2011-01-01"]
[12879,"SO",1107,"Lebern",2555,"Rüttenen","1848-09-12"]
[13003,"SO",1107,"Lebern",2556,"Selzach","1848-09-12"]
[11789,"SO",1108,"Olten",2571,"Boningen","1848-09-12"]
[11580,"SO",1108,"Olten",2572,"Däniken","1848-09-12"]
[12199,"SO",1108,"Olten",2573,"Dulliken","1848-09-12"]
[12309,"SO",1108,"Olten",2574,"Eppenberg-Wöschnau","1848-09-12"]
[12092,"SO",1108,"Olten",2575,"Fulenbach","1848-09-12"]
[13230,"SO",1108,"Olten",2576,"Gretzenbach","1973-01-01"]
[11936,"SO",1108,"Olten",2578,"Gunzgen","1848-09-12"]
[12003,"SO",1108,"Olten",2579,"Hägendorf","1848-09-12"]
[12651,"SO",1108,"Olten",2580,"Kappel (SO)","1848-09-12"]
[12486,"SO",1108,"Olten",2581,"Olten","1848-09-12"]
[12905,"SO",1108,"Olten",2582,"Rickenbach (SO)","1848-09-12"]
[12971,"SO",1108,"Olten",2583,"Schönenwerd","1848-09-12"]
[10578,"SO",1108,"Olten",2584,"Starrkirch-Wil","1848-09-12"]
[10469,"SO",1108,"Olten",2585,"Walterswil (SO)","1848-09-12"]
[10472,"SO",1108,"Olten",2586,"Wangen bei Olten","1848-09-12"]
[10384,"SO",1109,"Solothurn",2601,"Solothurn","1848-09-12"]
[11690,"SO",1110,"Thierstein",2611,"Bärschwil","1848-09-12"]
[11876,"SO",1110,"Thierstein",2612,"Beinwil (SO)","1848-09-12"]
[11822,"SO",1110,"Thierstein",2613,"Breitenbach","1848-09-12"]
[11511,"SO",1110,"Thierstein",2614,"Büsserach","1848-09-12"]
[12274,"SO",1110,"Thierstein",2615,"Erschwil","1848-09-12"]
[11988,"SO",1110,"Thierstein",2616,"Fehren","1848-09-12"]
[12009,"SO",1110,"Thierstein",2617,"Grindel","1848-09-12"]
[12154,"SO",1110,"Thierstein",2618,"Himmelried","1848-09-12"]
[12692,"SO",1110,"Thierstein",2619,"Kleinlützel","1848-09-12"]
[12385,"SO",1110,"Thierstein",2620,"Meltingen","1848-09-12"]
[12546,"SO",1110,"Thierstein",2621,"Nunningen","1848-09-12"]
[10324,"SO",1110,"Thierstein",2622,"Zullwil","1848-09-12"]
[11693,"BS",1200,"Kt. Basel-Stadt",2701,"Basel","1908-01-01"]
[11907,"BS",1200,"Kt. Basel-Stadt",2702,"Bettingen","1848-09-12"]
[12895,"BS",1200,"Kt. Basel-Stadt",2703,"Riehen","1848-09-12"]
[13824,"BL",1301,"Arlesheim",2761,"Aesch (BL)","1994-01-01"]
[13825,"BL",1301,"Arlesheim",2762,"Allschwil","1994-01-01"]
[13826,"BL",1301,"Arlesheim",2763,"Arlesheim","1994-01-01"]
[13827,"BL",1301,"Arlesheim",2764,"Biel-Benken","1994-01-01"]
[13828,"BL",1301,"Arlesheim",2765,"Binningen","1994-01-01"]
[13829,"BL",1301,"Arlesheim",2766,"Birsfelden","1994-01-01"]
[13830,"BL",1301,"Arlesheim",2767,"Bottmingen","1994-01-01"]
[13831,"BL",1301,"Arlesheim",2768,"Ettingen","1994-01-01"]
[13832,"BL",1301,"Arlesheim",2769,"Münchenstein","1994-01-01"]
[13833,"BL",1301,"Arlesheim",2770,"Muttenz","1994-01-01"]
[13834,"BL",1301,"Arlesheim",2771,"Oberwil (BL)","1994-01-01"]
[13835,"BL",1301,"Arlesheim",2772,"Pfeffingen","1994-01-01"]
[13836,"BL",1301,"Arlesheim",2773,"Reinach (BL)","1994-01-01"]
[13837,"BL",1301,"Arlesheim",2774,"Schönenbuch","1994-01-01"]
[13838,"BL",1301,"Arlesheim",2775,"Therwil","1994-01-01"]
[13839,"BL",1302,"Laufen",2781,"Blauen","1994-01-01"]
[13840,"BL",1302,"Laufen",2782,"Brislach","1994-01-01"]
[13841,"BL",1302,"Laufen",2783,"Burg im Leimental","1994-01-01"]
[13842,"BL",1302,"Laufen",2784,"Dittingen","1994-01-01"]
[13843,"BL",1302,"Laufen",2785,"Duggingen","1994-01-01"]
[13844,"BL",1302,"Laufen",2786,"Grellingen","1994-01-01"]
[13845,"BL",1302,"Laufen",2787,"Laufen","1994-01-01"]
[13846,"BL",1302,"Laufen",2788,"Liesberg","1994-01-01"]
[13847,"BL",1302,"Laufen",2789,"Nenzlingen","1994-01-01"]
[13848,"BL",1302,"Laufen",2790,"Roggenburg","1994-01-01"]
[13849,"BL",1302,"Laufen",2791,"Röschenz","1994-01-01"]
[13850,"BL",1302,"Laufen",2792,"Wahlen","1994-01-01"]
[13851,"BL",1302,"Laufen",2793,"Zwingen","1994-01-01"]
[13766,"BL",1303,"Liestal",2821,"Arisdorf","1994-01-01"]
[13767,"BL",1303,"Liestal",2822,"Augst","1994-01-01"]
[13768,"BL",1303,"Liestal",2823,"Bubendorf","1994-01-01"]
[13769,"BL",1303,"Liestal",2824,"Frenkendorf","1994-01-01"]
[13770,"BL",1303,"Liestal",2825,"Füllinsdorf","1994-01-01"]
[13771,"BL",1303,"Liestal",2826,"Giebenach","1994-01-01"]
[13772,"BL",1303,"Liestal",2827,"Hersberg","1994-01-01"]
[13773,"BL",1303,"Liestal",2828,"Lausen","1994-01-01"]
[13774,"BL",1303,"Liestal",2829,"Liestal","1994-01-01"]
[13775,"BL",1303,"Liestal",2830,"Lupsingen","1994-01-01"]
[13776,"BL",1303,"Liestal",2831,"Pratteln","1994-01-01"]
[13777,"BL",1303,"Liestal",2832,"Ramlinsburg","1994-01-01"]
[13778,"BL",1303,"Liestal",2833,"Seltisberg","1994-01-01"]
[13779,"BL",1303,"Liestal",2834,"Ziefen","1994-01-01"]
[13780,"BL",1304,"Sissach",2841,"Anwil","1994-01-01"]
[13781,"BL",1304,"Sissach",2842,"Böckten","1994-01-01"]
[13782,"BL",1304,"Sissach",2843,"Buckten","1994-01-01"]
[13783,"BL",1304,"Sissach",2844,"Buus","1994-01-01"]
[13784,"BL",1304,"Sissach",2845,"Diepflingen","1994-01-01"]
[13785,"BL",1304,"Sissach",2846,"Gelterkinden","1994-01-01"]
[13786,"BL",1304,"Sissach",2847,"Häfelfingen","1994-01-01"]
[13787,"BL",1304,"Sissach",2848,"Hemmiken","1994-01-01"]
[13788,"BL",1304,"Sissach",2849,"Itingen","1994-01-01"]
[13789,"BL",1304,"Sissach",2850,"Känerkinden","1994-01-01"]
[13790,"BL",1304,"Sissach",2851,"Kilchberg (BL)","1994-01-01"]
[13791,"BL",1304,"Sissach",2852,"Läufelfingen","1994-01-01"]
[13792,"BL",1304,"Sissach",2853,"Maisprach","1994-01-01"]
[13793,"BL",1304,"Sissach",2854,"Nusshof","1994-01-01"]
[13794,"BL",1304,"Sissach",2855,"Oltingen","1994-01-01"]
[13795,"BL",1304,"Sissach",2856,"Ormalingen","1994-01-01"]
[13796,"BL",1304,"Sissach",2857,"Rickenbach (BL)","1994-01-01"]
[13797,"BL",1304,"Sissach",2858,"Rothenfluh","1994-01-01"]
[13798,"BL",1304,"Sissach",2859,"Rümlingen","1994-01-01"]
[13799,"BL",1304,"Sissach",2860,"Rünenberg","1994-01-01"]
[13800,"BL",1304,"Sissach",2861,"Sissach","1994-01-01"]
[13801,"BL",1304,"Sissach",2862,"Tecknau","1994-01-01"]
[13802,"BL",1304,"Sissach",2863,"Tenniken","1994-01-01"]
[13803,"BL",1304,"Sissach",2864,"Thürnen","1994-01-01"]
[13804,"BL",1304,"Sissach",2865,"Wenslingen","1994-01-01"]
[13805,"BL",1304,"Sissach",2866,"Wintersingen","1994-01-01"]
[13806,"BL",1304,"Sissach",2867,"Wittinsburg","1994-01-01"]
[13807,"BL",1304,"Sissach",2868,"Zeglingen","1994-01-01"]
[13808,"BL",1304,"Sissach",2869,"Zunzgen","1994-01-01"]
[13809,"BL",1305,"Waldenburg",2881,"Arboldswil","1994-01-01"]
[13810,"BL",1305,"Waldenburg",2882,"Bennwil","1994-01-01"]
[13811,"BL",1305,"Waldenburg",2883,"Bretzwil","1994-01-01"]
[13812,"BL",1305,"Waldenburg",2884,"Diegten","1994-01-01"]
[13813,"BL",1305,"Waldenburg",2885,"Eptingen","1994-01-01"]
[13814,"BL",1305,"Waldenburg",2886,"Hölstein","1994-01-01"]
[13815,"BL",1305,"Waldenburg",2887,"Lampenberg","1994-01-01"]
[13816,"BL",1305,"Waldenburg",2888,"Langenbruck","1994-01-01"]
[13817,"BL",1305,"Waldenburg",2889,"Lauwil","1994-01-01"]
[13818,"BL",1305,"Waldenburg",2890,"Liedertswil","1994-01-01"]
[13819,"BL",1305,"Waldenburg",2891,"Niederdorf","1994-01-01"]
[13820,"BL",1305,"Waldenburg",2892,"Oberdorf (BL)","1994-01-01"]
[13821,"BL",1305,"Waldenburg",2893,"Reigoldswil","1994-01-01"]
[13822,"BL",1305,"Waldenburg",2894,"Titterten","1994-01-01"]
[13823,"BL",1305,"Waldenburg",2895,"Waldenburg","1994-01-01"]
[12071,"SH",1401,"Oberklettgau",2901,"Gächlingen","1848-09-12"]
[12801,"SH",1401,"Oberklettgau",2903,"Löhningen","1848-09-12"]
[12519,"SH",1401,"Oberklettgau",2904,"Neunkirch","1848-09-12"]
[11486,"SH",1402,"Reiat",2914,"Büttenhardt","1848-09-12"]
[12184,"SH",1402,"Reiat",2915,"Dörflingen","1848-09-12"]
[12800,"SH",1402,"Reiat",2917,"Lohn (SH)","1848-09-12"]
[10586,"SH",1402,"Reiat",2919,"Stetten (SH)","1848-09-12"]
[14948,"SH",1402,"Reiat",2920,"Thayngen","2009-01-01"]
[11688,"SH",1403,"Schaffhausen",2931,"Bargen (SH)","1848-09-12"]
[15604,"SH",1403,"Schaffhausen",2932,"Beringen","2013-01-01"]
[11474,"SH",1403,"Schaffhausen",2933,"Buchberg","1848-09-12"]
[12395,"SH",1403,"Schaffhausen",2936,"Merishausen","1848-09-12"]
[12525,"SH",1403,"Schaffhausen",2937,"Neuhausen am Rheinfall","1938-01-01"]
[12846,"SH",1403,"Schaffhausen",2938,"Rüdlingen","1848-09-12"]
[14949,"SH",1403,"Schaffhausen",2939,"Schaffhausen","2009-01-01"]
[11873,"SH",1404,"Schleitheim",2951,"Beggingen","1848-09-12"]
[13045,"SH",1404,"Schleitheim",2952,"Schleitheim","1848-09-12"]
[12989,"SH",1404,"Schleitheim",2953,"Siblingen","1848-09-12"]
[11479,"SH",1405,"Stein",2961,"Buch (SH)","1848-09-12"]
[12233,"SH",1405,"Stein",2962,"Hemishofen","1848-09-12"]
[13170,"SH",1405,"Stein",2963,"Ramsen","1848-09-12"]
[10592,"SH",1405,"Stein",2964,"Stein am Rhein","1848-09-12"]
[12020,"SH",1406,"Unterklettgau",2971,"Hallau","1934-01-01"]
[12471,"SH",1406,"Unterklettgau",2972,"Oberhallau","1848-09-12"]
[10882,"SH",1406,"Unterklettgau",2973,"Trasadingen","1848-09-12"]
[14515,"SH",1406,"Unterklettgau",2974,"Wilchingen","2005-01-01"]
[12304,"AR",1501,"Hinterland",3001,"Herisau","1848-09-12"]
[12175,"AR",1501,"Hinterland",3002,"Hundwil","1848-09-12"]
[12972,"AR",1501,"Hinterland",3003,"Schönengrund","1848-09-12"]
[12957,"AR",1501,"Hinterland",3004,"Schwellbrunn","1848-09-12"]
[10583,"AR",1501,"Hinterland",3005,"Stein (AR)","1848-09-12"]
[10946,"AR",1501,"Hinterland",3006,"Urnäsch","1848-09-12"]
[10461,"AR",1501,"Hinterland",3007,"Waldstatt","1848-09-12"]
[11451,"AR",1502,"Mittelland",3021,"Bühler","1848-09-12"]
[12077,"AR",1502,"Mittelland",3022,"Gais","1848-09-12"]
[10157,"AR",1502,"Mittelland",3023,"Speicher","1848-09-12"]
[10561,"AR",1502,"Mittelland",3024,"Teufen (AR)","1848-09-12"]
[10895,"AR",1502,"Mittelland",3025,"Trogen","1848-09-12"]
[11956,"AR",1503,"Vorderland",3031,"Grub (AR)","1848-09-12"]
[12253,"AR",1503,"Vorderland",3032,"Heiden","1848-09-12"]
[12705,"AR",1503,"Vorderland",3033,"Lutzenberg","1848-09-12"]
[13169,"AR",1503,"Vorderland",3034,"Rehetobel","1848-09-12"]
[12915,"AR",1503,"Vorderland",3035,"Reute (AR)","1875-01-01"]
[10458,"AR",1503,"Vorderland",3036,"Wald (AR)","1848-09-12"]
[10470,"AR",1503,"Vorderland",3037,"Walzenhausen","1848-09-12"]
[10358,"AR",1503,"Vorderland",3038,"Wolfhalden","1848-09-12"]
[14097,"AI",1600,"Kt. Appenzell i.Rh.",3101,"Appenzell","1997-01-01"]
[14098,"AI",1600,"Kt. Appenzell i.Rh.",3102,"Gonten","1997-01-01"]
[14099,"AI",1600,"Kt. Appenzell i.Rh.",3103,"Rüte","1997-01-01"]
[14100,"AI",1600,"Kt. Appenzell i.Rh.",3104,"Schlatt-Haslen","1997-01-01"]
[14101,"AI",1600,"Kt. Appenzell i.Rh.",3105,"Schwende","1997-01-01"]
[14102,"AI",1600,"Kt. Appenzell i.Rh.",3111,"Oberegg","1997-01-01"]
[14378,"SG",1721,"St. Gallen",3201,"Häggenschwil","2003-01-01"]
[14379,"SG",1721,"St. Gallen",3202,"Muolen","2003-01-01"]
[14380,"SG",1721,"St. Gallen",3203,"St. Gallen","2003-01-01"]
[14381,"SG",1721,"St. Gallen",3204,"Wittenbach","2003-01-01"]
[14382,"SG",1722,"Rorschach",3211,"Berg (SG)","2003-01-01"]
[14383,"SG",1721,"St. Gallen",3212,"Eggersriet","2003-01-01"]
[14384,"SG",1722,"Rorschach",3213,"Goldach","2003-01-01"]
[14385,"SG",1722,"Rorschach",3214,"Mörschwil","2003-01-01"]
[14386,"SG",1722,"Rorschach",3215,"Rorschach","2003-01-01"]
[14387,"SG",1722,"Rorschach",3216,"Rorschacherberg","2003-01-01"]
[14388,"SG",1722,"Rorschach",3217,"Steinach","2003-01-01"]
[14389,"SG",1722,"Rorschach",3218,"Tübach","2003-01-01"]
[14390,"SG",1722,"Rorschach",3219,"Untereggen","2003-01-01"]
[14391,"SG",1723,"Rheintal",3231,"Au (SG)","2003-01-01"]
[14392,"SG",1723,"Rheintal",3232,"Balgach","2003-01-01"]
[14393,"SG",1723,"Rheintal",3233,"Berneck","2003-01-01"]
[14394,"SG",1723,"Rheintal",3234,"Diepoldsau","2003-01-01"]
[14395,"SG",1723,"Rheintal",3235,"Rheineck","2003-01-01"]
[14396,"SG",1723,"Rheintal",3236,"St. Margrethen","2003-01-01"]
[14397,"SG",1722,"Rorschach",3237,"Thal","2003-01-01"]
[14398,"SG",1723,"Rheintal",3238,"Widnau","2003-01-01"]
[14399,"SG",1723,"Rheintal",3251,"Altstätten","2003-01-01"]
[14400,"SG",1723,"Rheintal",3252,"Eichberg","2003-01-01"]
[14401,"SG",1723,"Rheintal",3253,"Marbach (SG)","2003-01-01"]
[14402,"SG",1723,"Rheintal",3254,"Oberriet (SG)","2003-01-01"]
[14403,"SG",1723,"Rheintal",3255,"Rebstein","2003-01-01"]
[14404,"SG",1723,"Rheintal",3256,"Rüthi (SG)","2003-01-01"]
[14405,"SG",1724,"Werdenberg",3271,"Buchs (SG)","2003-01-01"]
[14406,"SG",1724,"Werdenberg",3272,"Gams","2003-01-01"]
[14407,"SG",1724,"Werdenberg",3273,"Grabs","2003-01-01"]
[14408,"SG",1724,"Werdenberg",3274,"Sennwald","2003-01-01"]
[14409,"SG",1724,"Werdenberg",3275,"Sevelen","2003-01-01"]
[14410,"SG",1724,"Werdenberg",3276,"Wartau","2003-01-01"]
[14411,"SG",1725,"Sarganserland",3291,"Bad Ragaz","2003-01-01"]
[14412,"SG",1725,"Sarganserland",3292,"Flums","2003-01-01"]
[14413,"SG",1725,"Sarganserland",3293,"Mels","2003-01-01"]
[14414,"SG",1725,"Sarganserland",3294,"Pfäfers","2003-01-01"]
[14415,"SG",1725,"Sarganserland",3295,"Quarten","2003-01-01"]
[14416,"SG",1725,"Sarganserland",3296,"Sargans","2003-01-01"]
[14417,"SG",1725,"Sarganserland",3297,"Vilters-Wangs","2003-01-01"]
[14418,"SG",1725,"Sarganserland",3298,"Walenstadt","2003-01-01"]
[14419,"SG",1726,"See-Gaster",3311,"Amden","2003-01-01"]
[14420,"SG",1726,"See-Gaster",3312,"Benken (SG)","2003-01-01"]
[14421,"SG",1726,"See-Gaster",3313,"Kaltbrunn","2003-01-01"]
[14423,"SG",1726,"See-Gaster",3315,"Schänis","2003-01-01"]
[14424,"SG",1726,"See-Gaster",3316,"Weesen","2003-01-01"]
[14432,"SG",1726,"See-Gaster",3338,"Schmerikon","2003-01-01"]
[14433,"SG",1726,"See-Gaster",3339,"Uznach","2003-01-01"]
[14925,"SG",1726,"See-Gaster",3340,"Rapperswil-Jona","2007-01-01"]
[15605,"SG",1726,"See-Gaster",3341,"Gommiswald","2013-01-01"]
[15606,"SG",1726,"See-Gaster",3342,"Eschenbach (SG)","2013-01-01"]
[14435,"SG",1727,"Toggenburg",3352,"Ebnat-Kappel","2003-01-01"]
[15381,"SG",1727,"Toggenburg",3359,"Wildhaus-Alt St. Johann","2010-01-01"]
[15607,"SG",1727,"Toggenburg",3360,"Nesslau","2013-01-01"]
[14441,"SG",1727,"Toggenburg",3372,"Hemberg","2003-01-01"]
[14443,"SG",1727,"Toggenburg",3374,"Lichtensteig","2003-01-01"]
[14444,"SG",1727,"Toggenburg",3375,"Oberhelfenschwil","2003-01-01"]
[14950,"SG",1727,"Toggenburg",3378,"Neckertal","2009-01-01"]
[15608,"SG",1727,"Toggenburg",3379,"Wattwil","2013-01-01"]
[14448,"SG",1727,"Toggenburg",3392,"Kirchberg (SG)","2003-01-01"]
[14449,"SG",1727,"Toggenburg",3393,"Lütisburg","2003-01-01"]
[14450,"SG",1727,"Toggenburg",3394,"Mosnang","2003-01-01"]
[15609,"SG",1727,"Toggenburg",3395,"Bütschwil-Ganterschwil","2013-01-01"]
[14451,"SG",1728,"Wil",3401,"Degersheim","2003-01-01"]
[14452,"SG",1728,"Wil",3402,"Flawil","2003-01-01"]
[14454,"SG",1728,"Wil",3405,"Jonschwil","2003-01-01"]
[14456,"SG",1728,"Wil",3407,"Oberuzwil","2003-01-01"]
[14457,"SG",1728,"Wil",3408,"Uzwil","2003-01-01"]
[14459,"SG",1728,"Wil",3422,"Niederbüren","2003-01-01"]
[14460,"SG",1728,"Wil",3423,"Niederhelfenschwil","2003-01-01"]
[14461,"SG",1728,"Wil",3424,"Oberbüren","2003-01-01"]
[14463,"SG",1728,"Wil",3426,"Zuzwil (SG)","2003-01-01"]
[15610,"SG",1728,"Wil",3427,"Wil (SG)","2013-01-01"]
[14464,"SG",1721,"St. Gallen",3441,"Andwil (SG)","2003-01-01"]
[14465,"SG",1721,"St. Gallen",3442,"Gaiserwald","2003-01-01"]
[14466,"SG",1721,"St. Gallen",3443,"Gossau (SG)","2003-01-01"]
[14467,"SG",1721,"St. Gallen",3444,"Waldkirch","2003-01-01"]
[15962,"GR",1841,"Albula",3506,"Vaz/Obervaz","2017-01-01"]
[15963,"GR",1841,"Albula",3513,"Lantsch/Lenz","2017-01-01"]
[15964,"GR",1841,"Albula",3514,"Schmitten (GR)","2017-01-01"]
[16062,"GR",1841,"Albula",3542,"Albula/Alvra","2017-01-01"]
[16068,"GR",1841,"Albula",3543,"Surses","2017-01-01"]
[16085,"GR",1841,"Albula",3544,"Bergün Filisur","2018-01-01"]
[15967,"GR",1842,"Bernina",3551,"Brusio","2017-01-01"]
[15968,"GR",1842,"Bernina",3561,"Poschiavo","2017-01-01"]
[15969,"GR",1850,"Surselva",3572,"Falera","2017-01-01"]
[15970,"GR",1850,"Surselva",3575,"Laax","2017-01-01"]
[15971,"GR",1850,"Surselva",3581,"Sagogn","2017-01-01"]
[15972,"GR",1850,"Surselva",3582,"Schluein","2017-01-01"]
[16063,"GR",1850,"Surselva",3603,"Vals","2017-01-01"]
[16058,"GR",1850,"Surselva",3618,"Lumnezia","2017-01-01"]
[16061,"GR",1850,"Surselva",3619,"Ilanz/Glion","2017-01-01"]
[15975,"GR",1851,"Viamala",3633,"Fürstenau","2017-01-01"]
[15976,"GR",1851,"Viamala",3637,"Rothenbrunnen","2017-01-01"]
[15977,"GR",1851,"Viamala",3638,"Scharans","2017-01-01"]
[15978,"GR",1851,"Viamala",3640,"Sils im Domleschg","2017-01-01"]
[16051,"GR",1851,"Viamala",3661,"Cazis","2017-01-01"]
[15979,"GR",1851,"Viamala",3662,"Flerden","2017-01-01"]
[15980,"GR",1851,"Viamala",3663,"Masein","2017-01-01"]
[16084,"GR",1851,"Viamala",3668,"Thusis","2018-01-01"]
[15982,"GR",1851,"Viamala",3669,"Tschappina","2017-01-01"]
[15983,"GR",1851,"Viamala",3670,"Urmein","2017-01-01"]
[16057,"GR",1850,"Surselva",3672,"Safiental","2017-01-01"]
[16064,"GR",1851,"Viamala",3673,"Domleschg","2017-01-01"]
[15984,"GR",1851,"Viamala",3681,"Avers","2017-01-01"]
[15987,"GR",1851,"Viamala",3695,"Sufers","2017-01-01"]
[16048,"GR",1851,"Viamala",3701,"Andeer","2017-01-01"]
[15991,"GR",1851,"Viamala",3711,"Rongellen","2017-01-01"]
[15992,"GR",1851,"Viamala",3712,"Zillis-Reischen","2017-01-01"]
[16045,"GR",1851,"Viamala",3713,"Ferrera","2017-01-01"]
[16125,"GR",1851,"Viamala",3714,"Rheinwald","2019-01-01"]
[16598,"GR",1851,"Viamala",3715,"Muntogna da Schons","2021-01-01"]
[15993,"GR",1844,"Imboden",3721,"Bonaduz","2017-01-01"]
[15994,"GR",1844,"Imboden",3722,"Domat/Ems","2017-01-01"]
[15995,"GR",1844,"Imboden",3723,"Rhäzüns","2017-01-01"]
[15996,"GR",1844,"Imboden",3731,"Felsberg","2017-01-01"]
[15997,"GR",1844,"Imboden",3732,"Flims","2017-01-01"]
[15998,"GR",1844,"Imboden",3733,"Tamins","2017-01-01"]
[15999,"GR",1844,"Imboden",3734,"Trin","2017-01-01"]
[16066,"GR",1843,"Engiadina B./Val Müstair",3746,"Zernez","2017-01-01"]
[16000,"GR",1843,"Engiadina B./Val Müstair",3752,"Samnaun","2017-01-01"]
[16065,"GR",1843,"Engiadina B./Val Müstair",3762,"Scuol","2017-01-01"]
[16059,"GR",1843,"Engiadina B./Val Müstair",3764,"Valsot","2017-01-01"]
[16001,"GR",1846,"Maloja",3781,"Bever","2017-01-01"]
[16002,"GR",1846,"Maloja",3782,"Celerina/Schlarigna","2017-01-01"]
[16003,"GR",1846,"Maloja",3783,"Madulain","2017-01-01"]
[16004,"GR",1846,"Maloja",3784,"Pontresina","2017-01-01"]
[16586,"GR",1846,"Maloja",3785,"La Punt Chamues-ch","2020-10-01"]
[16006,"GR",1846,"Maloja",3786,"Samedan","2017-01-01"]
[16007,"GR",1846,"Maloja",3787,"St. Moritz","2017-01-01"]
[16008,"GR",1846,"Maloja",3788,"S-chanf","2017-01-01"]
[16009,"GR",1846,"Maloja",3789,"Sils im Engadin/Segl","2017-01-01"]
[16010,"GR",1846,"Maloja",3790,"Silvaplana","2017-01-01"]
[16011,"GR",1846,"Maloja",3791,"Zuoz","2017-01-01"]
[16052,"GR",1846,"Maloja",3792,"Bregaglia","2017-01-01"]
[16012,"GR",1847,"Moesa",3804,"Buseno","2017-01-01"]
[16013,"GR",1847,"Moesa",3805,"Castaneda","2017-01-01"]
[16014,"GR",1847,"Moesa",3808,"Rossa","2017-01-01"]
[16015,"GR",1847,"Moesa",3810,"Santa Maria in Calanca","2017-01-01"]
[16016,"GR",1847,"Moesa",3821,"Lostallo","2017-01-01"]
[16017,"GR",1847,"Moesa",3822,"Mesocco","2017-01-01"]
[16018,"GR",1847,"Moesa",3823,"Soazza","2017-01-01"]
[16019,"GR",1847,"Moesa",3831,"Cama","2017-01-01"]
[15695,"GR",1847,"Moesa",3832,"Grono","2017-01-01"]
[16020,"GR",1847,"Moesa",3834,"Roveredo (GR)","2017-01-01"]
[16021,"GR",1847,"Moesa",3835,"San Vittore","2017-01-01"]
[16067,"GR",1847,"Moesa",3837,"Calanca","2017-01-01"]
[16049,"GR",1843,"Engiadina B./Val Müstair",3847,"Val Müstair","2017-01-01"]
[16047,"GR",1849,"Prättigau / Davos",3851,"Davos","2017-01-01"]
[16022,"GR",1849,"Prättigau / Davos",3861,"Fideris","2017-01-01"]
[16023,"GR",1849,"Prättigau / Davos",3862,"Furna","2017-01-01"]
[16024,"GR",1849,"Prättigau / Davos",3863,"Jenaz","2017-01-01"]
[16610,"GR",1849,"Prättigau / Davos",3871,"Klosters","2021-01-01"]
[16025,"GR",1849,"Prättigau / Davos",3881,"Conters im Prättigau","2017-01-01"]
[16026,"GR",1849,"Prättigau / Davos",3882,"Küblis","2017-01-01"]
[16071,"GR",1849,"Prättigau / Davos",3891,"Luzein","2017-01-01"]
[16599,"GR",1848,"Plessur",3901,"Chur","2021-01-01"]
[16053,"GR",1848,"Plessur",3911,"Churwalden","2017-01-01"]
[16060,"GR",1848,"Plessur",3921,"Arosa","2017-01-01"]
[16050,"GR",1848,"Plessur",3932,"Tschiertschen-Praden","2017-01-01"]
[16046,"GR",1845,"Landquart",3945,"Trimmis","2017-01-01"]
[16030,"GR",1845,"Landquart",3946,"Untervaz","2017-01-01"]
[16031,"GR",1845,"Landquart",3947,"Zizers","2017-01-01"]
[16032,"GR",1845,"Landquart",3951,"Fläsch","2017-01-01"]
[16033,"GR",1845,"Landquart",3952,"Jenins","2017-01-01"]
[16034,"GR",1845,"Landquart",3953,"Maienfeld","2017-01-01"]
[16035,"GR",1845,"Landquart",3954,"Malans","2017-01-01"]
[16055,"GR",1845,"Landquart",3955,"Landquart","2017-01-01"]
[16054,"GR",1849,"Prättigau / Davos",3961,"Grüsch","2017-01-01"]
[16036,"GR",1849,"Prättigau / Davos",3962,"Schiers","2017-01-01"]
[16037,"GR",1849,"Prättigau / Davos",3972,"Seewis im Prättigau","2017-01-01"]
[16086,"GR",1850,"Surselva",3981,"Breil/Brigels","2018-01-01"]
[16039,"GR",1850,"Surselva",3982,"Disentis/Mustér","2017-01-01"]
[16040,"GR",1850,"Surselva",3983,"Medel (Lucmagn)","2017-01-01"]
[16041,"GR",1850,"Surselva",3985,"Sumvitg","2017-01-01"]
[16042,"GR",1850,"Surselva",3986,"Tujetsch","2017-01-01"]
[16056,"GR",1850,"Surselva",3987,"Trun","2017-01-01"]
[16069,"GR",1850,"Surselva",3988,"Obersaxen Mundaun","2017-01-01"]
[15385,"AG",1901,"Aarau",4001,"Aarau","2010-01-01"]
[11916,"AG",1901,"Aarau",4002,"Biberstein","1848-09-12"]
[11454,"AG",1901,"Aarau",4003,"Buchs (AG)","1848-09-12"]
[11556,"AG",1901,"Aarau",4004,"Densbüren","1848-09-12"]
[14533,"AG",1901,"Aarau",4005,"Erlinsbach (AG)","2006-01-01"]
[12115,"AG",1901,"Aarau",4006,"Gränichen","1848-09-12"]
[12158,"AG",1901,"Aarau",4007,"Hirschthal","1848-09-12"]
[12594,"AG",1901,"Aarau",4008,"Küttigen","1848-09-12"]
[12380,"AG",1901,"Aarau",4009,"Muhen","1848-09-12"]
[12465,"AG",1901,"Aarau",4010,"Oberentfelden","1848-09-12"]
[10585,"AG",1901,"Aarau",4012,"Suhr","1848-09-12"]
[10888,"AG",1901,"Aarau",4013,"Unterentfelden","1848-09-12"]
[13189,"AG",1902,"Baden",4021,"Baden","1962-01-01"]
[11881,"AG",1902,"Baden",4022,"Bellikon","1848-09-12"]
[11856,"AG",1902,"Baden",4023,"Bergdietikon","1848-09-12"]
[11899,"AG",1902,"Baden",4024,"Birmenstorf (AG)","1848-09-12"]
[12277,"AG",1902,"Baden",4026,"Ennetbaden","1848-09-12"]
[11998,"AG",1902,"Baden",4027,"Fislisbach","1848-09-12"]
[11946,"AG",1902,"Baden",4028,"Freienwil","1848-09-12"]
[12110,"AG",1902,"Baden",4029,"Gebenstorf","1883-01-01"]
[12693,"AG",1902,"Baden",4030,"Killwangen","1848-09-12"]
[12652,"AG",1902,"Baden",4031,"Künten","1848-09-12"]
[12712,"AG",1902,"Baden",4032,"Mägenwil","1848-09-12"]
[12384,"AG",1902,"Baden",4033,"Mellingen","1848-09-12"]
[12514,"AG",1902,"Baden",4034,"Neuenhof","1848-09-12"]
[12565,"AG",1902,"Baden",4035,"Niederrohrdorf","1854-01-01"]
[12453,"AG",1902,"Baden",4037,"Oberrohrdorf","1854-01-01"]
[12456,"AG",1902,"Baden",4038,"Obersiggenthal","1848-09-12"]
[13164,"AG",1902,"Baden",4039,"Remetschwil","1854-01-01"]
[10366,"AG",1902,"Baden",4040,"Spreitenbach","1848-09-12"]
[10595,"AG",1902,"Baden",4041,"Stetten (AG)","1848-09-12"]
[10886,"AG",1902,"Baden",4042,"Turgi","1883-01-01"]
[10871,"AG",1902,"Baden",4044,"Untersiggenthal","1848-09-12"]
[10275,"AG",1902,"Baden",4045,"Wettingen","1848-09-12"]
[10356,"AG",1902,"Baden",4046,"Wohlenschwil","1906-01-01"]
[10344,"AG",1902,"Baden",4047,"Würenlingen","1848-09-12"]
[10303,"AG",1902,"Baden",4048,"Würenlos","1900-01-01"]
[14534,"AG",1902,"Baden",4049,"Ehrendingen","2006-01-01"]
[13668,"AG",1903,"Bremgarten",4061,"Arni (AG)","1983-01-01"]
[11857,"AG",1903,"Bremgarten",4062,"Berikon","1848-09-12"]
[15644,"AG",1903,"Bremgarten",4063,"Bremgarten (AG)","2014-01-01"]
[11488,"AG",1903,"Bremgarten",4064,"Büttikon","1848-09-12"]
[12217,"AG",1903,"Bremgarten",4065,"Dottikon","1848-09-12"]
[12157,"AG",1903,"Bremgarten",4066,"Eggenwil","1848-09-12"]
[12006,"AG",1903,"Bremgarten",4067,"Fischbach-Göslikon","1848-09-12"]
[12004,"AG",1903,"Bremgarten",4068,"Hägglingen","1848-09-12"]
[12644,"AG",1903,"Bremgarten",4071,"Jonen","1848-09-12"]
[12569,"AG",1903,"Bremgarten",4072,"Niederwil (AG)","1901-01-01"]
[12452,"AG",1903,"Bremgarten",4073,"Oberlunkhofen","1848-09-12"]
[13681,"AG",1903,"Bremgarten",4074,"Oberwil-Lieli","1984-01-01"]
[12830,"AG",1903,"Bremgarten",4075,"Rudolfstetten-Friedlisberg","1953-01-01"]
[13010,"AG",1903,"Bremgarten",4076,"Sarmenstorf","1848-09-12"]
[10550,"AG",1903,"Bremgarten",4077,"Tägerig","1848-09-12"]
[10853,"AG",1903,"Bremgarten",4078,"Uezwil","1848-09-12"]
[10867,"AG",1903,"Bremgarten",4079,"Unterlunkhofen","1848-09-12"]
[15386,"AG",1903,"Bremgarten",4080,"Villmergen","2010-01-01"]
[10278,"AG",1903,"Bremgarten",4081,"Widen","1848-09-12"]
[10354,"AG",1903,"Bremgarten",4082,"Wohlen (AG)","1914-01-01"]
[10322,"AG",1903,"Bremgarten",4083,"Zufikon","1848-09-12"]
[13669,"AG",1903,"Bremgarten",4084,"Islisberg","1983-01-01"]
[11681,"AG",1904,"Brugg",4091,"Auenstein","1848-09-12"]
[11901,"AG",1904,"Brugg",4092,"Birr","1848-09-12"]
[11837,"AG",1904,"Brugg",4093,"Birrhard","1848-09-12"]
[11851,"AG",1904,"Brugg",4094,"Bözen","1848-09-12"]
[16135,"AG",1904,"Brugg",4095,"Brugg","2020-01-01"]
[12126,"AG",1904,"Brugg",4096,"Effingen","1848-09-12"]
[12243,"AG",1904,"Brugg",4097,"Elfingen","1848-09-12"]
[12000,"AG",1904,"Brugg",4099,"Habsburg","1848-09-12"]
[14375,"AG",1904,"Brugg",4100,"Hausen (AG)","2003-01-01"]
[16087,"AG",1904,"Brugg",4104,"Lupfig","2018-01-01"]
[12753,"AG",1904,"Brugg",4105,"Mandach","1848-09-12"]
[12321,"AG",1904,"Brugg",4106,"Mönthal","1848-09-12"]
[12354,"AG",1904,"Brugg",4107,"Mülligen","1848-09-12"]
[13161,"AG",1904,"Brugg",4110,"Remigen","1848-09-12"]
[12890,"AG",1904,"Brugg",4111,"Riniken","1848-09-12"]
[12838,"AG",1904,"Brugg",4112,"Rüfenach","1898-01-01"]
[10760,"AG",1904,"Brugg",4117,"Thalheim (AG)","1848-09-12"]
[10911,"AG",1904,"Brugg",4120,"Veltheim (AG)","1848-09-12"]
[14535,"AG",1904,"Brugg",4121,"Villigen","2006-01-01"]
[10009,"AG",1904,"Brugg",4122,"Villnachern","1848-09-12"]
[10360,"AG",1904,"Brugg",4123,"Windisch","1848-09-12"]
[15615,"AG",1904,"Brugg",4124,"Bözberg","2013-01-01"]
[15645,"AG",1904,"Brugg",4125,"Schinznach","2014-01-01"]
[11886,"AG",1905,"Kulm",4131,"Beinwil am See","1848-09-12"]
[11913,"AG",1905,"Kulm",4132,"Birrwil","1848-09-12"]
[11503,"AG",1905,"Kulm",4133,"Burg (AG)","1848-09-12"]
[12122,"AG",1905,"Kulm",4134,"Dürrenäsch","1848-09-12"]
[12047,"AG",1905,"Kulm",4135,"Gontenschwil","1848-09-12"]
[12140,"AG",1905,"Kulm",4136,"Holziken","1848-09-12"]
[12783,"AG",1905,"Kulm",4137,"Leimbach (AG)","1848-09-12"]
[12778,"AG",1905,"Kulm",4138,"Leutwil","1848-09-12"]
[12397,"AG",1905,"Kulm",4139,"Menziken","1848-09-12"]
[12454,"AG",1905,"Kulm",4140,"Oberkulm","1848-09-12"]
[13174,"AG",1905,"Kulm",4141,"Reinach (AG)","1848-09-12"]
[13043,"AG",1905,"Kulm",4142,"Schlossrued","1848-09-12"]
[13042,"AG",1905,"Kulm",4143,"Schmiedrued","1848-09-12"]
[13005,"AG",1905,"Kulm",4144,"Schöftland","1848-09-12"]
[10562,"AG",1905,"Kulm",4145,"Teufenthal (AG)","1848-09-12"]
[10866,"AG",1905,"Kulm",4146,"Unterkulm","1848-09-12"]
[10301,"AG",1905,"Kulm",4147,"Zetzwil","1848-09-12"]
[12170,"AG",1906,"Laufenburg",4161,"Eiken","1848-09-12"]
[11953,"AG",1906,"Laufenburg",4163,"Frick","1848-09-12"]
[12114,"AG",1906,"Laufenburg",4164,"Gansingen","1848-09-12"]
[12065,"AG",1906,"Laufenburg",4165,"Gipf-Oberfrick","1848-09-12"]
[12317,"AG",1906,"Laufenburg",4166,"Herznach","1848-09-12"]
[12211,"AG",1906,"Laufenburg",4167,"Hornussen","1848-09-12"]
[15389,"AG",1906,"Laufenburg",4169,"Kaisten","2010-01-01"]
[15390,"AG",1906,"Laufenburg",4170,"Laufenburg","2010-01-01"]
[12357,"AG",1906,"Laufenburg",4172,"Münchwilen (AG)","1848-09-12"]
[12472,"AG",1906,"Laufenburg",4173,"Oberhof","1848-09-12"]
[12509,"AG",1906,"Laufenburg",4175,"Oeschgen","1848-09-12"]
[12964,"AG",1906,"Laufenburg",4176,"Schwaderloch","1848-09-12"]
[12980,"AG",1906,"Laufenburg",4177,"Sisseln","1848-09-12"]
[10849,"AG",1906,"Laufenburg",4179,"Ueken","1848-09-12"]
[10353,"AG",1906,"Laufenburg",4181,"Wittnau","1848-09-12"]
[10359,"AG",1906,"Laufenburg",4182,"Wölflinswil","1848-09-12"]
[10309,"AG",1906,"Laufenburg",4183,"Zeihen","1853-01-01"]
[15388,"AG",1906,"Laufenburg",4184,"Mettauertal","2010-01-01"]
[11783,"AG",1907,"Lenzburg",4191,"Ammerswil","1848-09-12"]
[11790,"AG",1907,"Lenzburg",4192,"Boniswil","1899-01-01"]
[11472,"AG",1907,"Lenzburg",4193,"Brunegg","1848-09-12"]
[11566,"AG",1907,"Lenzburg",4194,"Dintikon","1848-09-12"]
[12167,"AG",1907,"Lenzburg",4195,"Egliswil","1848-09-12"]
[12252,"AG",1907,"Lenzburg",4196,"Fahrwangen","1848-09-12"]
[11996,"AG",1907,"Lenzburg",4197,"Hallwil","1951-01-01"]
[12235,"AG",1907,"Lenzburg",4198,"Hendschiken","1848-09-12"]
[12139,"AG",1907,"Lenzburg",4199,"Holderbank (AG)","1848-09-12"]
[12179,"AG",1907,"Lenzburg",4200,"Hunzenschwil","1848-09-12"]
[12782,"AG",1907,"Lenzburg",4201,"Lenzburg","1848-09-12"]
[12411,"AG",1907,"Lenzburg",4202,"Meisterschwanden","1900-01-01"]
[12367,"AG",1907,"Lenzburg",4203,"Möriken-Wildegg","1951-01-01"]
[12561,"AG",1907,"Lenzburg",4204,"Niederlenz","1848-09-12"]
[13113,"AG",1907,"Lenzburg",4205,"Othmarsingen","1848-09-12"]
[12833,"AG",1907,"Lenzburg",4206,"Rupperswil","1848-09-12"]
[13056,"AG",1907,"Lenzburg",4207,"Schafisheim","1848-09-12"]
[12949,"AG",1907,"Lenzburg",4208,"Seengen","1848-09-12"]
[12996,"AG",1907,"Lenzburg",4209,"Seon","1899-01-01"]
[10579,"AG",1907,"Lenzburg",4210,"Staufen","1848-09-12"]
[11741,"AG",1908,"Muri",4221,"Abtwil","1848-09-12"]
[11764,"AG",1908,"Muri",4222,"Aristau","1848-09-12"]
[11659,"AG",1908,"Muri",4223,"Auw","1848-09-12"]
[11875,"AG",1908,"Muri",4224,"Beinwil (Freiamt)","1951-01-01"]
[11888,"AG",1908,"Muri",4226,"Besenbüren","1848-09-12"]
[11910,"AG",1908,"Muri",4227,"Bettwil","1848-09-12"]
[11800,"AG",1908,"Muri",4228,"Boswil","1848-09-12"]
[11464,"AG",1908,"Muri",4229,"Bünzen","1940-01-01"]
[11490,"AG",1908,"Muri",4230,"Buttwil","1848-09-12"]
[11564,"AG",1908,"Muri",4231,"Dietwil","1848-09-12"]
[12104,"AG",1908,"Muri",4232,"Geltwil","1848-09-12"]
[12638,"AG",1908,"Muri",4233,"Kallern","1848-09-12"]
[15503,"AG",1908,"Muri",4234,"Merenschwand","2012-01-01"]
[12358,"AG",1908,"Muri",4235,"Mühlau","1848-09-12"]
[12438,"AG",1908,"Muri",4236,"Muri (AG)","1848-09-12"]
[12446,"AG",1908,"Muri",4237,"Oberrüti","1848-09-12"]
[12851,"AG",1908,"Muri",4238,"Rottenschwil","1899-01-01"]
[12983,"AG",1908,"Muri",4239,"Sins","1941-01-01"]
[10468,"AG",1908,"Muri",4240,"Waltenschwil","1940-01-01"]
[12228,"AG",1909,"Rheinfelden",4251,"Hellikon","1848-09-12"]
[12643,"AG",1909,"Rheinfelden",4252,"Kaiseraugst","1848-09-12"]
[12711,"AG",1909,"Rheinfelden",4253,"Magden","1848-09-12"]
[12429,"AG",1909,"Rheinfelden",4254,"Möhlin","1848-09-12"]
[12355,"AG",1909,"Rheinfelden",4255,"Mumpf","1848-09-12"]
[12468,"AG",1909,"Rheinfelden",4256,"Obermumpf","1848-09-12"]
[12508,"AG",1909,"Rheinfelden",4257,"Olsberg","1848-09-12"]
[12911,"AG",1909,"Rheinfelden",4258,"Rheinfelden","1848-09-12"]
[12967,"AG",1909,"Rheinfelden",4259,"Schupfart","1848-09-12"]
[10582,"AG",1909,"Rheinfelden",4260,"Stein (AG)","1848-09-12"]
[10462,"AG",1909,"Rheinfelden",4261,"Wallbach","1848-09-12"]
[10446,"AG",1909,"Rheinfelden",4262,"Wegenstetten","1848-09-12"]
[10310,"AG",1909,"Rheinfelden",4263,"Zeiningen","1848-09-12"]
[10329,"AG",1909,"Rheinfelden",4264,"Zuzgen","1848-09-12"]
[11738,"AG",1910,"Zofingen",4271,"Aarburg","1848-09-12"]
[11845,"AG",1910,"Zofingen",4273,"Bottenwil","1848-09-12"]
[11636,"AG",1910,"Zofingen",4274,"Brittnau","1848-09-12"]
[12696,"AG",1910,"Zofingen",4275,"Kirchleerau","1848-09-12"]
[12677,"AG",1910,"Zofingen",4276,"Kölliken","1848-09-12"]
[12328,"AG",1910,"Zofingen",4277,"Moosleerau","1848-09-12"]
[12335,"AG",1910,"Zofingen",4279,"Murgenthal","1901-01-01"]
[12494,"AG",1910,"Zofingen",4280,"Oftringen","1848-09-12"]
[16126,"AG",1910,"Zofingen",4281,"Reitnau","2019-01-01"]
[12852,"AG",1910,"Zofingen",4282,"Rothrist","1890-01-01"]
[12873,"AG",1910,"Zofingen",4283,"Safenwil","1848-09-12"]
[10707,"AG",1910,"Zofingen",4284,"Staffelbach","1901-01-01"]
[10590,"AG",1910,"Zofingen",4285,"Strengelbach","1848-09-12"]
[10850,"AG",1910,"Zofingen",4286,"Uerkheim","1848-09-12"]
[10370,"AG",1910,"Zofingen",4287,"Vordemwald","1848-09-12"]
[10338,"AG",1910,"Zofingen",4288,"Wiliberg","1848-09-12"]
[14361,"AG",1910,"Zofingen",4289,"Zofingen","2002-01-01"]
[11706,"AG",1911,"Zurzach",4301,"Baldingen","1848-09-12"]
[11814,"AG",1911,"Zurzach",4302,"Böbikon","1848-09-12"]
[11840,"AG",1911,"Zurzach",4303,"Böttstein","1848-09-12"]
[12210,"AG",1911,"Zurzach",4304,"Döttingen","1848-09-12"]
[15646,"AG",1911,"Zurzach",4305,"Endingen","2014-01-01"]
[11999,"AG",1911,"Zurzach",4306,"Fisibach","1848-09-12"]
[12091,"AG",1911,"Zurzach",4307,"Full-Reuenthal","1902-01-01"]
[12653,"AG",1911,"Zurzach",4308,"Kaiserstuhl","1848-09-12"]
[12672,"AG",1911,"Zurzach",4309,"Klingnau","1848-09-12"]
[12685,"AG",1911,"Zurzach",4310,"Koblenz","1848-09-12"]
[12694,"AG",1911,"Zurzach",4311,"Leibstadt","1866-01-01"]
[12786,"AG",1911,"Zurzach",4312,"Lengnau (AG)","1848-09-12"]
[12775,"AG",1911,"Zurzach",4313,"Leuggern","1902-01-01"]
[12404,"AG",1911,"Zurzach",4314,"Mellikon","1848-09-12"]
[13183,"AG",1911,"Zurzach",4315,"Rekingen (AG)","1848-09-12"]
[12893,"AG",1911,"Zurzach",4316,"Rietheim","1848-09-12"]
[12835,"AG",1911,"Zurzach",4317,"Rümikon","1848-09-12"]
[13040,"AG",1911,"Zurzach",4318,"Schneisingen","1848-09-12"]
[12987,"AG",1911,"Zurzach",4319,"Siglistorf","1848-09-12"]
[10541,"AG",1911,"Zurzach",4320,"Tegerfelden","1848-09-12"]
[10350,"AG",1911,"Zurzach",4322,"Wislikofen","1899-01-01"]
[14920,"AG",1911,"Zurzach",4323,"Bad Zurzach","2006-12-01"]
[15456,"TG",2011,"Arbon",4401,"Arbon","2011-01-01"]
[15403,"TG",2011,"Arbon",4406,"Dozwil","2011-01-01"]
[15402,"TG",2011,"Arbon",4411,"Egnach","2011-01-01"]
[15406,"TG",2011,"Arbon",4416,"Hefenhofen","2011-01-01"]
[15404,"TG",2011,"Arbon",4421,"Horn","2011-01-01"]
[15409,"TG",2011,"Arbon",4426,"Kesswil","2011-01-01"]
[15412,"TG",2011,"Arbon",4431,"Roggwil (TG)","2011-01-01"]
[15411,"TG",2011,"Arbon",4436,"Romanshorn","2011-01-01"]
[15413,"TG",2011,"Arbon",4441,"Salmsach","2011-01-01"]
[15417,"TG",2011,"Arbon",4446,"Sommeri","2011-01-01"]
[15397,"TG",2011,"Arbon",4451,"Uttwil","2011-01-01"]
[15451,"TG",2011,"Arbon",4461,"Amriswil","2011-01-01"]
[15449,"TG",2015,"Weinfelden",4471,"Bischofszell","2011-01-01"]
[15427,"TG",2015,"Weinfelden",4476,"Erlen","2011-01-01"]
[15446,"TG",2015,"Weinfelden",4486,"Hauptwil-Gottshaus","2011-01-01"]
[15466,"TG",2015,"Weinfelden",4495,"Hohentannen","2011-01-01"]
[15448,"TG",2015,"Weinfelden",4501,"Kradolf-Schönenberg","2011-01-01"]
[15450,"TG",2015,"Weinfelden",4506,"Sulgen","2011-01-01"]
[15452,"TG",2015,"Weinfelden",4511,"Zihlschlacht-Sitterdorf","2011-01-01"]
[15468,"TG",2012,"Frauenfeld",4536,"Basadingen-Schlattingen","2011-01-01"]
[15473,"TG",2012,"Frauenfeld",4545,"Diessenhofen","2011-01-01"]
[15467,"TG",2012,"Frauenfeld",4546,"Schlatt (TG)","2011-01-01"]
[15442,"TG",2014,"Münchwilen",4551,"Aadorf","2011-01-01"]
[15423,"TG",2012,"Frauenfeld",4561,"Felben-Wellhausen","2011-01-01"]
[15458,"TG",2012,"Frauenfeld",4566,"Frauenfeld","2011-01-01"]
[15457,"TG",2012,"Frauenfeld",4571,"Gachnang","2011-01-01"]
[15469,"TG",2012,"Frauenfeld",4590,"Hüttlingen","2011-01-01"]
[15410,"TG",2012,"Frauenfeld",4591,"Matzingen","2011-01-01"]
[15447,"TG",2012,"Frauenfeld",4601,"Neunforn","2011-01-01"]
[15396,"TG",2012,"Frauenfeld",4606,"Stettfurt","2011-01-01"]
[15429,"TG",2012,"Frauenfeld",4611,"Thundorf","2011-01-01"]
[15431,"TG",2012,"Frauenfeld",4616,"Uesslingen-Buch","2011-01-01"]
[15430,"TG",2012,"Frauenfeld",4621,"Warth-Weiningen","2011-01-01"]
[15398,"TG",2013,"Kreuzlingen",4641,"Altnau","2011-01-01"]
[15425,"TG",2013,"Kreuzlingen",4643,"Bottighofen","2011-01-01"]
[15421,"TG",2013,"Kreuzlingen",4646,"Ermatingen","2011-01-01"]
[15401,"TG",2013,"Kreuzlingen",4651,"Gottlieben","2011-01-01"]
[15400,"TG",2013,"Kreuzlingen",4656,"Güttingen","2011-01-01"]
[15445,"TG",2013,"Kreuzlingen",4666,"Kemmental","2011-01-01"]
[15408,"TG",2013,"Kreuzlingen",4671,"Kreuzlingen","2011-01-01"]
[15459,"TG",2013,"Kreuzlingen",4681,"Langrickenbach","2011-01-01"]
[15460,"TG",2013,"Kreuzlingen",4683,"Lengwil","2011-01-01"]
[15426,"TG",2013,"Kreuzlingen",4691,"Münsterlingen","2011-01-01"]
[15394,"TG",2013,"Kreuzlingen",4696,"Tägerwilen","2011-01-01"]
[15432,"TG",2013,"Kreuzlingen",4701,"Wäldi","2011-01-01"]
[15433,"TG",2015,"Weinfelden",4711,"Affeltrangen","2011-01-01"]
[15434,"TG",2014,"Münchwilen",4716,"Bettwiesen","2011-01-01"]
[15443,"TG",2014,"Münchwilen",4721,"Bichelsee-Balterswil","2011-01-01"]
[15470,"TG",2014,"Münchwilen",4723,"Braunau","2011-01-01"]
[15454,"TG",2014,"Münchwilen",4724,"Eschlikon","2011-01-01"]
[15419,"TG",2014,"Münchwilen",4726,"Fischingen","2011-01-01"]
[15435,"TG",2014,"Münchwilen",4741,"Lommis","2011-01-01"]
[15407,"TG",2014,"Münchwilen",4746,"Münchwilen (TG)","2011-01-01"]
[15463,"TG",2014,"Münchwilen",4751,"Rickenbach (TG)","2011-01-01"]
[15415,"TG",2015,"Weinfelden",4756,"Schönholzerswilen","2011-01-01"]
[15453,"TG",2014,"Münchwilen",4761,"Sirnach","2011-01-01"]
[15471,"TG",2014,"Münchwilen",4776,"Tobel-Tägerschen","2011-01-01"]
[15441,"TG",2014,"Münchwilen",4781,"Wängi","2011-01-01"]
[15462,"TG",2014,"Münchwilen",4786,"Wilen (TG)","2011-01-01"]
[15418,"TG",2015,"Weinfelden",4791,"Wuppenau","2011-01-01"]
[15399,"TG",2012,"Frauenfeld",4801,"Berlingen","2011-01-01"]
[15405,"TG",2012,"Frauenfeld",4806,"Eschenz","2011-01-01"]
[15464,"TG",2012,"Frauenfeld",4811,"Herdern","2011-01-01"]
[15472,"TG",2012,"Frauenfeld",4816,"Homburg","2011-01-01"]
[15455,"TG",2012,"Frauenfeld",4821,"Hüttwilen","2011-01-01"]
[15424,"TG",2012,"Frauenfeld",4826,"Mammern","2011-01-01"]
[15416,"TG",2012,"Frauenfeld",4831,"Müllheim","2011-01-01"]
[15465,"TG",2012,"Frauenfeld",4841,"Pfyn","2011-01-01"]
[15414,"TG",2013,"Kreuzlingen",4846,"Raperswilen","2011-01-01"]
[15422,"TG",2013,"Kreuzlingen",4851,"Salenstein","2011-01-01"]
[15395,"TG",2012,"Frauenfeld",4864,"Steckborn","2011-01-01"]
[15440,"TG",2012,"Frauenfeld",4871,"Wagenhausen","2011-01-01"]
[15436,"TG",2015,"Weinfelden",4881,"Amlikon-Bissegg","2011-01-01"]
[15461,"TG",2015,"Weinfelden",4891,"Berg (TG)","2011-01-01"]
[15438,"TG",2015,"Weinfelden",4901,"Birwinken","2011-01-01"]
[15428,"TG",2015,"Weinfelden",4911,"Bürglen (TG)","2011-01-01"]
[15444,"TG",2015,"Weinfelden",4921,"Bussnang","2011-01-01"]
[15420,"TG",2015,"Weinfelden",4941,"Märstetten","2011-01-01"]
[15437,"TG",2015,"Weinfelden",4946,"Weinfelden","2011-01-01"]
[15439,"TG",2015,"Weinfelden",4951,"Wigoltingen","2011-01-01"]
[11768,"TI",2101,"Bellinzona",5001,"Arbedo-Castione","1848-09-12"]
[16078,"TI",2101,"Bellinzona",5002,"Bellinzona","2017-04-02"]
[14518,"TI",2101,"Bellinzona",5003,"Cadenazzo","2005-03-13"]
[12665,"TI",2101,"Bellinzona",5009,"Isone","1848-09-12"]
[12725,"TI",2101,"Bellinzona",5010,"Lumino","1848-09-12"]
[13012,"TI",2101,"Bellinzona",5017,"Sant'Antonino","1848-09-12"]
[14492,"TI",2102,"Blenio",5048,"Acquarossa","2004-04-04"]
[14918,"TI",2102,"Blenio",5049,"Blenio","2006-10-22"]
[15509,"TI",2102,"Blenio",5050,"Serravalle","2012-04-01"]
[11719,"TI",2103,"Leventina",5061,"Airolo","1848-09-12"]
[11872,"TI",2103,"Leventina",5063,"Bedretto","1848-09-12"]
[11815,"TI",2103,"Leventina",5064,"Bodio","1848-09-12"]
[11579,"TI",2103,"Leventina",5071,"Dalpe","1848-09-12"]
[15685,"TI",2103,"Leventina",5072,"Faido","2016-04-10"]
[12066,"TI",2103,"Leventina",5073,"Giornico","1848-09-12"]
[13153,"TI",2103,"Leventina",5076,"Personico","1848-09-12"]
[13084,"TI",2103,"Leventina",5077,"Pollegio","1848-09-12"]
[13099,"TI",2103,"Leventina",5078,"Prato (Leventina)","1939-01-01"]
[13092,"TI",2103,"Leventina",5079,"Quinto","1848-09-12"]
[11673,"TI",2104,"Locarno",5091,"Ascona","1848-09-12"]
[11832,"TI",2104,"Locarno",5096,"Brione sopra Minusio","1848-09-12"]
[11833,"TI",2104,"Locarno",5097,"Brissago","1848-09-12"]
[12051,"TI",2104,"Locarno",5108,"Gordola","1848-09-12"]
[16588,"TI",2104,"Locarno",5112,"Lavertezzo","2020-10-18"]
[12828,"TI",2104,"Locarno",5113,"Locarno","1928-01-01"]
[12807,"TI",2104,"Locarno",5115,"Losone","1848-09-12"]
[12393,"TI",2104,"Locarno",5117,"Mergoscia","1848-09-12"]
[12436,"TI",2104,"Locarno",5118,"Minusio","1848-09-12"]
[12463,"TI",2104,"Locarno",5120,"Muralto","1881-01-01"]
[13135,"TI",2104,"Locarno",5121,"Orselina","1881-01-01"]
[12922,"TI",2104,"Locarno",5125,"Ronco sopra Ascona","1848-09-12"]
[10558,"TI",2104,"Locarno",5131,"Tenero-Contra","1914-01-01"]
[15686,"TI",2104,"Locarno",5136,"Onsernone","2016-04-10"]
[16587,"TI",2104,"Locarno",5138,"Cugnasco-Gerra","2020-10-18"]
[11722,"TI",2105,"Lugano",5141,"Agno","1848-09-12"]
[11757,"TI",2105,"Lugano",5143,"Aranno","1848-09-12"]
[11703,"TI",2105,"Lugano",5144,"Arogno","1848-09-12"]
[11684,"TI",2105,"Lugano",5146,"Astano","1848-09-12"]
[11902,"TI",2105,"Lugano",5148,"Bedano","1848-09-12"]
[11770,"TI",2105,"Lugano",5149,"Bedigliora","1848-09-12"]
[14939,"TI",2105,"Lugano",5151,"Bioggio","2008-04-20"]
[11806,"TI",2105,"Lugano",5154,"Bissone","1848-09-12"]
[11475,"TI",2105,"Lugano",5160,"Brusino Arsizio","1848-09-12"]
[11492,"TI",2105,"Lugano",5161,"Cademario","1848-09-12"]
[11484,"TI",2105,"Lugano",5162,"Cadempino","1848-09-12"]
[11404,"TI",2105,"Lugano",5167,"Canobbio","1848-09-12"]
[11413,"TI",2105,"Lugano",5171,"Caslano","1848-09-12"]
[11616,"TI",2105,"Lugano",5176,"Comano","1848-09-12"]
[13252,"TI",2105,"Lugano",5178,"Croglio","1976-04-04"]
[11570,"TI",2105,"Lugano",5180,"Cureglia","1848-09-12"]
[11571,"TI",2105,"Lugano",5181,"Curio","1848-09-12"]
[12042,"TI",2105,"Lugano",5186,"Grancia","1848-09-12"]
[12118,"TI",2105,"Lugano",5187,"Gravesano","1848-09-12"]
[12623,"TI",2105,"Lugano",5189,"Lamone","1848-09-12"]
[15628,"TI",2105,"Lugano",5192,"Lugano","2013-04-14"]
[12714,"TI",2105,"Lugano",5193,"Magliaso","1848-09-12"]
[12765,"TI",2105,"Lugano",5194,"Manno","1848-09-12"]
[12762,"TI",2105,"Lugano",5195,"Maroggia","1848-09-12"]
[12749,"TI",2105,"Lugano",5196,"Massagno","1848-09-12"]
[12412,"TI",2105,"Lugano",5197,"Melano","1848-09-12"]
[12388,"TI",2105,"Lugano",5198,"Melide","1848-09-12"]
[12442,"TI",2105,"Lugano",5199,"Mezzovico-Vira","1848-09-12"]
[12420,"TI",2105,"Lugano",5200,"Miglieglia","1848-09-12"]
[12326,"TI",2105,"Lugano",5202,"Monteggio","1848-09-12"]
[12331,"TI",2105,"Lugano",5203,"Morcote","1848-09-12"]
[12531,"TI",2105,"Lugano",5205,"Muzzano","1848-09-12"]
[12539,"TI",2105,"Lugano",5206,"Neggio","1848-09-12"]
[12564,"TI",2105,"Lugano",5207,"Novaggio","1848-09-12"]
[12488,"TI",2105,"Lugano",5208,"Origlio","1848-09-12"]
[13116,"TI",2105,"Lugano",5210,"Paradiso","1929-01-01"]
[13138,"TI",2105,"Lugano",5212,"Ponte Capriasca","1848-09-12"]
[13066,"TI",2105,"Lugano",5213,"Ponte Tresa","1848-09-12"]
[13073,"TI",2105,"Lugano",5214,"Porza","1848-09-12"]
[13093,"TI",2105,"Lugano",5216,"Pura","1848-09-12"]
[12848,"TI",2105,"Lugano",5219,"Rovio","1848-09-12"]
[13059,"TI",2105,"Lugano",5221,"Savosa","1848-09-12"]
[12993,"TI",2105,"Lugano",5222,"Sessa","1848-09-12"]
[10415,"TI",2105,"Lugano",5225,"Sorengo","1848-09-12"]
[14938,"TI",2105,"Lugano",5226,"Capriasca","2008-04-20"]
[10880,"TI",2105,"Lugano",5227,"Torricella-Taverne","1848-09-12"]
[10916,"TI",2105,"Lugano",5230,"Vernate","1848-09-12"]
[10943,"TI",2105,"Lugano",5231,"Vezia","1848-09-12"]
[10755,"TI",2105,"Lugano",5233,"Vico Morcote","1848-09-12"]
[15512,"TI",2105,"Lugano",5236,"Collina d'Oro","2012-04-01"]
[14519,"TI",2105,"Lugano",5237,"Alto Malcantone","2005-03-13"]
[15392,"TI",2105,"Lugano",5238,"Monteceneri","2010-11-21"]
[11707,"TI",2106,"Mendrisio",5242,"Balerna","1848-09-12"]
[14499,"TI",2106,"Mendrisio",5249,"Castel San Pietro","2004-04-04"]
[13251,"TI",2106,"Mendrisio",5250,"Chiasso","1976-04-04"]
[11594,"TI",2106,"Mendrisio",5251,"Coldrerio","1848-09-12"]
[15630,"TI",2106,"Mendrisio",5254,"Mendrisio","2013-04-14"]
[12329,"TI",2106,"Mendrisio",5257,"Morbio Inferiore","1848-09-12"]
[12544,"TI",2106,"Mendrisio",5260,"Novazzano","1848-09-12"]
[12904,"TI",2106,"Mendrisio",5263,"Riva San Vitale","1848-09-12"]
[10381,"TI",2106,"Mendrisio",5266,"Stabio","1848-09-12"]
[10930,"TI",2106,"Mendrisio",5268,"Vacallo","1848-09-12"]
[14974,"TI",2106,"Mendrisio",5269,"Breggia","2009-10-25"]
[11904,"TI",2107,"Riviera",5281,"Biasca","1848-09-12"]
[16079,"TI",2107,"Riviera",5287,"Riviera","2017-04-02"]
[11798,"TI",2108,"Vallemaggia",5304,"Bosco/Gurin","1934-01-01"]
[11402,"TI",2108,"Vallemaggia",5307,"Campo (Vallemaggia)","1848-09-12"]
[11388,"TI",2108,"Vallemaggia",5309,"Cerentino","1848-09-12"]
[14919,"TI",2108,"Vallemaggia",5310,"Cevio","2006-10-22"]
[12814,"TI",2108,"Vallemaggia",5315,"Linescio","1858-01-01"]
[14495,"TI",2108,"Vallemaggia",5317,"Maggia","2004-04-04"]
[14497,"TI",2108,"Vallemaggia",5323,"Lavizzara","2004-04-04"]
[14940,"TI",2108,"Vallemaggia",5324,"Avegno Gordevio","2008-04-20"]
[15627,"TI",2104,"Locarno",5396,"Terre di Pedemonte","2013-04-14"]
[14973,"TI",2104,"Locarno",5397,"Centovalli","2009-10-25"]
[15391,"TI",2104,"Locarno",5398,"Gambarogno","2010-04-25"]
[16589,"TI",2104,"Locarno",5399,"Verzasca","2020-10-18"]
[14540,"VD",2221,"Aigle",5401,"Aigle","2006-09-01"]
[14541,"VD",2221,"Aigle",5402,"Bex","2006-09-01"]
[14808,"VD",2221,"Aigle",5403,"Chessel","2006-09-01"]
[14793,"VD",2221,"Aigle",5404,"Corbeyrier","2006-09-01"]
[14747,"VD",2221,"Aigle",5405,"Gryon","2006-09-01"]
[14645,"VD",2221,"Aigle",5406,"Lavey-Morcles","2006-09-01"]
[14625,"VD",2221,"Aigle",5407,"Leysin","2006-09-01"]
[14620,"VD",2221,"Aigle",5408,"Noville","2006-09-01"]
[14663,"VD",2221,"Aigle",5409,"Ollon","2006-09-01"]
[14670,"VD",2221,"Aigle",5410,"Ormont-Dessous","2006-09-01"]
[14669,"VD",2221,"Aigle",5411,"Ormont-Dessus","2006-09-01"]
[14616,"VD",2221,"Aigle",5412,"Rennaz","2006-09-01"]
[14603,"VD",2221,"Aigle",5413,"Roche (VD)","2006-09-01"]
[14914,"VD",2221,"Aigle",5414,"Villeneuve (VD)","2006-09-01"]
[14911,"VD",2221,"Aigle",5415,"Yvorne","2006-09-01"]
[14780,"VD",2227,"Morges",5421,"Apples","2006-09-01"]
[16600,"VD",2227,"Morges",5422,"Aubonne","2021-01-01"]
[14784,"VD",2227,"Morges",5423,"Ballens","2006-09-01"]
[14763,"VD",2227,"Morges",5424,"Berolle","2006-09-01"]
[14757,"VD",2227,"Morges",5425,"Bière","2006-09-01"]
[14764,"VD",2227,"Morges",5426,"Bougy-Villars","2006-09-01"]
[14743,"VD",2227,"Morges",5427,"Féchy","2006-09-01"]
[14730,"VD",2227,"Morges",5428,"Gimel","2006-09-01"]
[14624,"VD",2228,"Nyon",5429,"Longirod","2006-09-01"]
[14631,"VD",2228,"Nyon",5430,"Marchissy","2006-09-01"]
[14679,"VD",2227,"Morges",5431,"Mollens (VD)","2006-09-01"]
[14615,"VD",2228,"Nyon",5434,"Saint-George","2006-09-01"]
[14601,"VD",2227,"Morges",5435,"Saint-Livres","2006-09-01"]
[14586,"VD",2227,"Morges",5436,"Saint-Oyens","2006-09-01"]
[14583,"VD",2227,"Morges",5437,"Saubraz","2006-09-01"]
[15487,"VD",2222,"Broye-Vully",5451,"Avenches","2011-07-01"]
[14546,"VD",2222,"Broye-Vully",5456,"Cudrefin","2006-09-01"]
[14749,"VD",2222,"Broye-Vully",5458,"Faoug","2006-09-01"]
[15488,"VD",2222,"Broye-Vully",5464,"Vully-les-Lacs","2011-07-01"]
[14755,"VD",2223,"Gros-de-Vaud",5471,"Bettens","2006-09-01"]
[14766,"VD",2223,"Gros-de-Vaud",5472,"Bournens","2006-09-01"]
[14765,"VD",2223,"Gros-de-Vaud",5473,"Boussens","2006-09-01"]
[14651,"VD",2227,"Morges",5474,"La Chaux (Cossonay)","2006-09-01"]
[14853,"VD",2227,"Morges",5475,"Chavannes-le-Veyron","2006-09-01"]
[14814,"VD",2227,"Morges",5476,"Chevilly","2006-09-01"]
[14828,"VD",2227,"Morges",5477,"Cossonay","2006-09-01"]
[14826,"VD",2227,"Morges",5478,"Cottens (VD)","2006-09-01"]
[14830,"VD",2227,"Morges",5479,"Cuarnens","2006-09-01"]
[14819,"VD",2223,"Gros-de-Vaud",5480,"Daillens","2006-09-01"]
[14854,"VD",2227,"Morges",5481,"Dizy","2006-09-01"]
[14716,"VD",2227,"Morges",5482,"Eclépens","2006-09-01"]
[14746,"VD",2227,"Morges",5483,"Ferreyres","2006-09-01"]
[14734,"VD",2227,"Morges",5484,"Gollion","2006-09-01"]
[14736,"VD",2227,"Morges",5485,"Grancy","2006-09-01"]
[14652,"VD",2227,"Morges",5486,"L'Isle","2006-09-01"]
[14547,"VD",2223,"Gros-de-Vaud",5487,"Lussery-Villars","2006-09-01"]
[14683,"VD",2227,"Morges",5488,"Mauraz","2006-09-01"]
[14676,"VD",2223,"Gros-de-Vaud",5489,"Mex (VD)","2006-09-01"]
[14681,"VD",2227,"Morges",5490,"Moiry","2006-09-01"]
[14686,"VD",2227,"Morges",5491,"Mont-la-Ville","2006-09-01"]
[14695,"VD",2227,"Morges",5492,"Montricher","2006-09-01"]
[14668,"VD",2227,"Morges",5493,"Orny","2006-09-01"]
[14567,"VD",2227,"Morges",5494,"Pampigny","2006-09-01"]
[14555,"VD",2223,"Gros-de-Vaud",5495,"Penthalaz","2006-09-01"]
[14556,"VD",2223,"Gros-de-Vaud",5496,"Penthaz","2006-09-01"]
[14578,"VD",2227,"Morges",5497,"Pompaples","2006-09-01"]
[14657,"VD",2227,"Morges",5498,"La Sarraz","2006-09-01"]
[14594,"VD",2227,"Morges",5499,"Senarclens","2006-09-01"]
[14593,"VD",2227,"Morges",5500,"Sévery","2006-09-01"]
[14900,"VD",2223,"Gros-de-Vaud",5501,"Sullens","2006-09-01"]
[14908,"VD",2223,"Gros-de-Vaud",5503,"Vufflens-la-Ville","2006-09-01"]
[14957,"VD",2223,"Gros-de-Vaud",5511,"Assens","2009-01-01"]
[14552,"VD",2223,"Gros-de-Vaud",5512,"Bercher","2006-09-01"]
[14758,"VD",2223,"Gros-de-Vaud",5513,"Bioley-Orjulaz","2006-09-01"]
[14771,"VD",2223,"Gros-de-Vaud",5514,"Bottens","2006-09-01"]
[14772,"VD",2223,"Gros-de-Vaud",5515,"Bretigny-sur-Morrens","2006-09-01"]
[14825,"VD",2223,"Gros-de-Vaud",5516,"Cugy (VD)","2006-09-01"]
[14717,"VD",2223,"Gros-de-Vaud",5518,"Echallens","2006-09-01"]
[14708,"VD",2223,"Gros-de-Vaud",5520,"Essertines-sur-Yverdon","2006-09-01"]
[14702,"VD",2223,"Gros-de-Vaud",5521,"Etagnières","2006-09-01"]
[14744,"VD",2223,"Gros-de-Vaud",5522,"Fey","2006-09-01"]
[14748,"VD",2223,"Gros-de-Vaud",5523,"Froideville","2006-09-01"]
[14687,"VD",2223,"Gros-de-Vaud",5527,"Morrens (VD)","2006-09-01"]
[14562,"VD",2223,"Gros-de-Vaud",5529,"Oulens-sous-Echallens","2006-09-01"]
[14565,"VD",2223,"Gros-de-Vaud",5530,"Pailly","2006-09-01"]
[14557,"VD",2223,"Gros-de-Vaud",5531,"Penthéréaz","2006-09-01"]
[14577,"VD",2223,"Gros-de-Vaud",5533,"Poliez-Pittet","2006-09-01"]
[14619,"VD",2223,"Gros-de-Vaud",5534,"Rueyres","2006-09-01"]
[14612,"VD",2223,"Gros-de-Vaud",5535,"Saint-Barthélemy (VD)","2006-09-01"]
[14887,"VD",2223,"Gros-de-Vaud",5537,"Villars-le-Terroir","2006-09-01"]
[14910,"VD",2223,"Gros-de-Vaud",5539,"Vuarrens","2006-09-01"]
[15489,"VD",2223,"Gros-de-Vaud",5540,"Montilliez","2011-07-01"]
[15490,"VD",2223,"Gros-de-Vaud",5541,"Goumoëns","2011-07-01"]
[14777,"VD",2224,"Jura-Nord vaudois",5551,"Bonvillars","2006-09-01"]
[14843,"VD",2224,"Jura-Nord vaudois",5552,"Bullet","2006-09-01"]
[14848,"VD",2224,"Jura-Nord vaudois",5553,"Champagne","2006-09-01"]
[14798,"VD",2224,"Jura-Nord vaudois",5554,"Concise","2006-09-01"]
[14804,"VD",2224,"Jura-Nord vaudois",5555,"Corcelles-près-Concise","2006-09-01"]
[14742,"VD",2224,"Jura-Nord vaudois",5556,"Fiez","2006-09-01"]
[14751,"VD",2224,"Jura-Nord vaudois",5557,"Fontaines-sur-Grandson","2006-09-01"]
[14741,"VD",2224,"Jura-Nord vaudois",5559,"Giez","2006-09-01"]
[14732,"VD",2224,"Jura-Nord vaudois",5560,"Grandevent","2006-09-01"]
[14725,"VD",2224,"Jura-Nord vaudois",5561,"Grandson","2006-09-01"]
[14633,"VD",2224,"Jura-Nord vaudois",5562,"Mauborget","2006-09-01"]
[14661,"VD",2224,"Jura-Nord vaudois",5563,"Mutrux","2006-09-01"]
[14617,"VD",2224,"Jura-Nord vaudois",5564,"Novalles","2006-09-01"]
[14672,"VD",2224,"Jura-Nord vaudois",5565,"Onnens (VD)","2006-09-01"]
[14572,"VD",2224,"Jura-Nord vaudois",5566,"Provence","2006-09-01"]
[14591,"VD",2224,"Jura-Nord vaudois",5568,"Sainte-Croix","2006-09-01"]
[15492,"VD",2224,"Jura-Nord vaudois",5571,"Tévenon","2011-07-01"]
[14760,"VD",2226,"Lavaux-Oron",5581,"Belmont-sur-Lausanne","2006-09-01"]
[14810,"VD",2225,"Lausanne",5582,"Cheseaux-sur-Lausanne","2006-09-01"]
[14832,"VD",2229,"Ouest lausannois",5583,"Crissier","2006-09-01"]
[14701,"VD",2225,"Lausanne",5584,"Epalinges","2006-09-01"]
[14644,"VD",2225,"Lausanne",5585,"Jouxtens-Mézery","2006-09-01"]
[14649,"VD",2225,"Lausanne",5586,"Lausanne","2006-09-01"]
[14647,"VD",2225,"Lausanne",5587,"Le Mont-sur-Lausanne","2006-09-01"]
[14568,"VD",2226,"Lavaux-Oron",5588,"Paudex","2006-09-01"]
[14575,"VD",2229,"Ouest lausannois",5589,"Prilly","2006-09-01"]
[14574,"VD",2226,"Lavaux-Oron",5590,"Pully","2006-09-01"]
[14580,"VD",2229,"Ouest lausannois",5591,"Renens (VD)","2006-09-01"]
[14605,"VD",2225,"Lausanne",5592,"Romanel-sur-Lausanne","2006-09-01"]
[14806,"VD",2226,"Lavaux-Oron",5601,"Chexbres","2006-09-01"]
[14753,"VD",2226,"Lavaux-Oron",5604,"Forel (Lavaux)","2006-09-01"]
[14640,"VD",2226,"Lavaux-Oron",5606,"Lutry","2006-09-01"]
[14573,"VD",2226,"Lavaux-Oron",5607,"Puidoux","2006-09-01"]
[14602,"VD",2226,"Lavaux-Oron",5609,"Rivaz","2006-09-01"]
[14588,"VD",2226,"Lavaux-Oron",5610,"Saint-Saphorin (Lavaux)","2006-09-01"]
[14584,"VD",2226,"Lavaux-Oron",5611,"Savigny","2006-09-01"]
[15493,"VD",2226,"Lavaux-Oron",5613,"Bourg-en-Lavaux","2011-07-01"]
[14781,"VD",2227,"Morges",5621,"Aclens","2006-09-01"]
[14770,"VD",2227,"Morges",5622,"Bremblens","2006-09-01"]
[14844,"VD",2227,"Morges",5623,"Buchillon","2006-09-01"]
[15651,"VD",2229,"Ouest lausannois",5624,"Bussigny","2014-05-01"]
[14551,"VD",2227,"Morges",5625,"Bussy-Chardonney","2006-09-01"]
[14860,"VD",2229,"Ouest lausannois",5627,"Chavannes-près-Renens","2006-09-01"]
[14815,"VD",2227,"Morges",5628,"Chigny","2006-09-01"]
[14816,"VD",2227,"Morges",5629,"Clarmont","2006-09-01"]
[14824,"VD",2227,"Morges",5631,"Denens","2006-09-01"]
[14822,"VD",2227,"Morges",5632,"Denges","2006-09-01"]
[14718,"VD",2227,"Morges",5633,"Echandens","2006-09-01"]
[15494,"VD",2227,"Morges",5634,"Echichens","2011-07-01"]
[14721,"VD",2229,"Ouest lausannois",5635,"Ecublens (VD)","2006-09-01"]
[14703,"VD",2227,"Morges",5636,"Etoy","2006-09-01"]
[14650,"VD",2227,"Morges",5637,"Lavigny","2006-09-01"]
[14622,"VD",2227,"Morges",5638,"Lonay","2006-09-01"]
[14636,"VD",2227,"Morges",5639,"Lully (VD)","2006-09-01"]
[14637,"VD",2227,"Morges",5640,"Lussy-sur-Morges","2006-09-01"]
[14690,"VD",2227,"Morges",5642,"Morges","2006-09-01"]
[14570,"VD",2227,"Morges",5643,"Préverenges","2006-09-01"]
[14608,"VD",2227,"Morges",5644,"Reverolle","2006-09-01"]
[14606,"VD",2227,"Morges",5645,"Romanel-sur-Morges","2006-09-01"]
[14587,"VD",2227,"Morges",5646,"Saint-Prex","2006-09-01"]
[14590,"VD",2229,"Ouest lausannois",5648,"Saint-Sulpice (VD)","2006-09-01"]
[14880,"VD",2227,"Morges",5649,"Tolochenaz","2006-09-01"]
[14874,"VD",2227,"Morges",5650,"Vaux-sur-Morges","2006-09-01"]
[14885,"VD",2229,"Ouest lausannois",5651,"Villars-Sainte-Croix","2006-09-01"]
[14882,"VD",2227,"Morges",5652,"Villars-sous-Yens","2006-09-01"]
[14907,"VD",2227,"Morges",5653,"Vufflens-le-Château","2006-09-01"]
[14901,"VD",2227,"Morges",5654,"Vullierens","2006-09-01"]
[14913,"VD",2227,"Morges",5655,"Yens","2006-09-01"]
[14767,"VD",2223,"Gros-de-Vaud",5661,"Boulens","2006-09-01"]
[14841,"VD",2222,"Broye-Vully",5663,"Bussy-sur-Moudon","2006-09-01"]
[14856,"VD",2222,"Broye-Vully",5665,"Chavannes-sur-Moudon","2006-09-01"]
[14821,"VD",2222,"Broye-Vully",5669,"Curtilles","2006-09-01"]
[14715,"VD",2222,"Broye-Vully",5671,"Dompierre (VD)","2006-09-01"]
[14698,"VD",2222,"Broye-Vully",5673,"Hermenches","2006-09-01"]
[14623,"VD",2222,"Broye-Vully",5674,"Lovatens","2006-09-01"]
[16073,"VD",2222,"Broye-Vully",5675,"Lucens","2017-01-01"]
[14685,"VD",2222,"Broye-Vully",5678,"Moudon","2006-09-01"]
[14665,"VD",2223,"Gros-de-Vaud",5680,"Ogens","2006-09-01"]
[14571,"VD",2222,"Broye-Vully",5683,"Prévonloup","2006-09-01"]
[14611,"VD",2222,"Broye-Vully",5684,"Rossenges","2006-09-01"]
[14898,"VD",2222,"Broye-Vully",5688,"Syens","2006-09-01"]
[14888,"VD",2222,"Broye-Vully",5690,"Villars-le-Comte","2006-09-01"]
[14909,"VD",2222,"Broye-Vully",5692,"Vucherens","2006-09-01"]
[15616,"VD",2223,"Gros-de-Vaud",5693,"Montanaire","2013-01-01"]
[14779,"VD",2228,"Nyon",5701,"Arnex-sur-Nyon","2006-09-01"]
[15652,"VD",2228,"Nyon",5702,"Arzier-Le Muids","2014-05-01"]
[14788,"VD",2228,"Nyon",5703,"Bassins","2006-09-01"]
[14761,"VD",2228,"Nyon",5704,"Begnins","2006-09-01"]
[14776,"VD",2228,"Nyon",5705,"Bogis-Bossey","2006-09-01"]
[14775,"VD",2228,"Nyon",5706,"Borex","2006-09-01"]
[14859,"VD",2228,"Nyon",5707,"Chavannes-de-Bogis","2006-09-01"]
[14858,"VD",2228,"Nyon",5708,"Chavannes-des-Bois","2006-09-01"]
[14809,"VD",2228,"Nyon",5709,"Chéserex","2006-09-01"]
[14817,"VD",2228,"Nyon",5710,"Coinsins","2006-09-01"]
[14799,"VD",2228,"Nyon",5711,"Commugny","2006-09-01"]
[14794,"VD",2228,"Nyon",5712,"Coppet","2006-09-01"]
[16609,"VD",2228,"Nyon",5713,"Crans (VD)","2021-01-01"]
[14835,"VD",2228,"Nyon",5714,"Crassier","2006-09-01"]
[14711,"VD",2228,"Nyon",5715,"Duillier","2006-09-01"]
[14706,"VD",2228,"Nyon",5716,"Eysins","2006-09-01"]
[14750,"VD",2228,"Nyon",5717,"Founex","2006-09-01"]
[14726,"VD",2228,"Nyon",5718,"Genolier","2006-09-01"]
[14731,"VD",2228,"Nyon",5719,"Gingins","2006-09-01"]
[14735,"VD",2228,"Nyon",5720,"Givrins","2006-09-01"]
[14733,"VD",2228,"Nyon",5721,"Gland","2006-09-01"]
[14728,"VD",2228,"Nyon",5722,"Grens","2006-09-01"]
[14680,"VD",2228,"Nyon",5723,"Mies","2006-09-01"]
[14659,"VD",2228,"Nyon",5724,"Nyon","2006-09-01"]
[14582,"VD",2228,"Nyon",5725,"Prangins","2006-09-01"]
[14658,"VD",2228,"Nyon",5726,"La Rippe","2006-09-01"]
[14613,"VD",2228,"Nyon",5727,"Saint-Cergue","2006-09-01"]
[14598,"VD",2228,"Nyon",5728,"Signy-Avenex","2006-09-01"]
[14897,"VD",2228,"Nyon",5729,"Tannay","2006-09-01"]
[14879,"VD",2228,"Nyon",5730,"Trélex","2006-09-01"]
[14639,"VD",2228,"Nyon",5731,"Le Vaud","2006-09-01"]
[14892,"VD",2228,"Nyon",5732,"Vich","2006-09-01"]
[14653,"VD",2224,"Jura-Nord vaudois",5741,"L'Abergement","2006-09-01"]
[14783,"VD",2224,"Jura-Nord vaudois",5742,"Agiez","2006-09-01"]
[14778,"VD",2224,"Jura-Nord vaudois",5743,"Arnex-sur-Orbe","2006-09-01"]
[14785,"VD",2224,"Jura-Nord vaudois",5744,"Ballaigues","2006-09-01"]
[14787,"VD",2224,"Jura-Nord vaudois",5745,"Baulmes","2006-09-01"]
[14786,"VD",2224,"Jura-Nord vaudois",5746,"Bavois","2006-09-01"]
[14773,"VD",2224,"Jura-Nord vaudois",5747,"Bofflens","2006-09-01"]
[14769,"VD",2224,"Jura-Nord vaudois",5748,"Bretonnières","2006-09-01"]
[16074,"VD",2224,"Jura-Nord vaudois",5749,"Chavornay","2017-01-01"]
[14627,"VD",2224,"Jura-Nord vaudois",5750,"Les Clées","2006-09-01"]
[14831,"VD",2224,"Jura-Nord vaudois",5752,"Croy","2006-09-01"]
[14643,"VD",2224,"Jura-Nord vaudois",5754,"Juriens","2006-09-01"]
[14621,"VD",2224,"Jura-Nord vaudois",5755,"Lignerolle","2006-09-01"]
[14689,"VD",2224,"Jura-Nord vaudois",5756,"Montcherand","2006-09-01"]
[14673,"VD",2224,"Jura-Nord vaudois",5757,"Orbe","2006-09-01"]
[14655,"VD",2224,"Jura-Nord vaudois",5758,"La Praz","2006-09-01"]
[14569,"VD",2224,"Jura-Nord vaudois",5759,"Premier","2006-09-01"]
[14553,"VD",2224,"Jura-Nord vaudois",5760,"Rances","2006-09-01"]
[14549,"VD",2224,"Jura-Nord vaudois",5761,"Romainmôtier-Envy","2006-09-01"]
[14595,"VD",2224,"Jura-Nord vaudois",5762,"Sergey","2006-09-01"]
[14868,"VD",2224,"Jura-Nord vaudois",5763,"Valeyres-sous-Rances","2006-09-01"]
[14866,"VD",2224,"Jura-Nord vaudois",5764,"Vallorbe","2006-09-01"]
[14873,"VD",2224,"Jura-Nord vaudois",5765,"Vaulion","2006-09-01"]
[14903,"VD",2224,"Jura-Nord vaudois",5766,"Vuiteboeuf","2006-09-01"]
[14792,"VD",2222,"Broye-Vully",5785,"Corcelles-le-Jorat","2006-09-01"]
[14705,"VD",2226,"Lavaux-Oron",5788,"Essertes","2006-09-01"]
[14545,"VD",2226,"Lavaux-Oron",5790,"Maracon","2006-09-01"]
[14697,"VD",2226,"Lavaux-Oron",5792,"Montpreveyres","2006-09-01"]
[14607,"VD",2222,"Broye-Vully",5798,"Ropraz","2006-09-01"]
[15505,"VD",2226,"Lavaux-Oron",5799,"Servion","2012-01-01"]
[14902,"VD",2222,"Broye-Vully",5803,"Vulliens","2006-09-01"]
[15491,"VD",2223,"Gros-de-Vaud",5804,"Jorat-Menthue","2011-07-01"]
[15504,"VD",2226,"Lavaux-Oron",5805,"Oron","2012-01-01"]
[15687,"VD",2226,"Lavaux-Oron",5806,"Jorat-Mézières","2016-07-01"]
[14852,"VD",2222,"Broye-Vully",5812,"Champtauroz","2006-09-01"]
[14807,"VD",2222,"Broye-Vully",5813,"Chevroux","2006-09-01"]
[14805,"VD",2222,"Broye-Vully",5816,"Corcelles-près-Payerne","2006-09-01"]
[14729,"VD",2222,"Broye-Vully",5817,"Grandcour","2006-09-01"]
[14707,"VD",2222,"Broye-Vully",5819,"Henniez","2006-09-01"]
[14682,"VD",2222,"Broye-Vully",5821,"Missy","2006-09-01"]
[14560,"VD",2222,"Broye-Vully",5822,"Payerne","2006-09-01"]
[14877,"VD",2222,"Broye-Vully",5827,"Trey","2006-09-01"]
[14881,"VD",2222,"Broye-Vully",5828,"Treytorrens (Payerne)","2006-09-01"]
[14542,"VD",2222,"Broye-Vully",5830,"Villarzel","2006-09-01"]
[15496,"VD",2222,"Broye-Vully",5831,"Valbroye","2011-07-01"]
[14845,"VD",2230,"Riviera-Pays-d'Enhaut",5841,"Château-d'Oex","2006-09-01"]
[14609,"VD",2230,"Riviera-Pays-d'Enhaut",5842,"Rossinière","2006-09-01"]
[14618,"VD",2230,"Riviera-Pays-d'Enhaut",5843,"Rougemont","2006-09-01"]
[14782,"VD",2227,"Morges",5851,"Allaman","2006-09-01"]
[14837,"VD",2228,"Nyon",5852,"Bursinel","2006-09-01"]
[14840,"VD",2228,"Nyon",5853,"Bursins","2006-09-01"]
[14842,"VD",2228,"Nyon",5854,"Burtigny","2006-09-01"]
[14712,"VD",2228,"Nyon",5855,"Dully","2006-09-01"]
[14704,"VD",2228,"Nyon",5856,"Essertines-sur-Rolle","2006-09-01"]
[14739,"VD",2228,"Nyon",5857,"Gilly","2006-09-01"]
[14638,"VD",2228,"Nyon",5858,"Luins","2006-09-01"]
[14694,"VD",2228,"Nyon",5859,"Mont-sur-Rolle","2006-09-01"]
[14558,"VD",2228,"Nyon",5860,"Perroy","2006-09-01"]
[14604,"VD",2228,"Nyon",5861,"Rolle","2006-09-01"]
[14894,"VD",2228,"Nyon",5862,"Tartegnin","2006-09-01"]
[14916,"VD",2228,"Nyon",5863,"Vinzel","2006-09-01"]
[14654,"VD",2224,"Jura-Nord vaudois",5871,"L'Abbaye","2006-09-01"]
[14646,"VD",2224,"Jura-Nord vaudois",5872,"Le Chenit","2006-09-01"]
[14648,"VD",2224,"Jura-Nord vaudois",5873,"Le Lieu","2006-09-01"]
[14774,"VD",2230,"Riviera-Pays-d'Enhaut",5881,"Blonay","2006-09-01"]
[14846,"VD",2230,"Riviera-Pays-d'Enhaut",5882,"Chardonne","2006-09-01"]
[14802,"VD",2230,"Riviera-Pays-d'Enhaut",5883,"Corseaux","2006-09-01"]
[14833,"VD",2230,"Riviera-Pays-d'Enhaut",5884,"Corsier-sur-Vevey","2006-09-01"]
[14642,"VD",2230,"Riviera-Pays-d'Enhaut",5885,"Jongny","2006-09-01"]
[14550,"VD",2230,"Riviera-Pays-d'Enhaut",5886,"Montreux","2006-09-01"]
[14599,"VD",2230,"Riviera-Pays-d'Enhaut",5888,"Saint-Légier-La Chiésaz","2006-09-01"]
[14656,"VD",2230,"Riviera-Pays-d'Enhaut",5889,"La Tour-de-Peilz","2006-09-01"]
[14872,"VD",2230,"Riviera-Pays-d'Enhaut",5890,"Vevey","2006-09-01"]
[14876,"VD",2230,"Riviera-Pays-d'Enhaut",5891,"Veytaux","2006-09-01"]
[14759,"VD",2224,"Jura-Nord vaudois",5902,"Belmont-sur-Yverdon","2006-09-01"]
[14756,"VD",2224,"Jura-Nord vaudois",5903,"Bioley-Magnoux","2006-09-01"]
[14864,"VD",2224,"Jura-Nord vaudois",5904,"Chamblon","2006-09-01"]
[15506,"VD",2224,"Jura-Nord vaudois",5905,"Champvent","2012-01-01"]
[14857,"VD",2224,"Jura-Nord vaudois",5907,"Chavannes-le-Chêne","2006-09-01"]
[14862,"VD",2224,"Jura-Nord vaudois",5908,"Chêne-Pâquier","2006-09-01"]
[14811,"VD",2224,"Jura-Nord vaudois",5909,"Cheseaux-Noréaz","2006-09-01"]
[14836,"VD",2224,"Jura-Nord vaudois",5910,"Cronay","2006-09-01"]
[14829,"VD",2224,"Jura-Nord vaudois",5911,"Cuarny","2006-09-01"]
[14820,"VD",2224,"Jura-Nord vaudois",5912,"Démoret","2006-09-01"]
[15507,"VD",2224,"Jura-Nord vaudois",5913,"Donneloye","2012-01-01"]
[14699,"VD",2224,"Jura-Nord vaudois",5914,"Ependes (VD)","2006-09-01"]
[14634,"VD",2224,"Jura-Nord vaudois",5919,"Mathod","2006-09-01"]
[14678,"VD",2224,"Jura-Nord vaudois",5921,"Molondin","2006-09-01"]
[14691,"VD",2224,"Jura-Nord vaudois",5922,"Montagny-près-Yverdon","2006-09-01"]
[14666,"VD",2223,"Gros-de-Vaud",5923,"Oppens","2006-09-01"]
[14671,"VD",2224,"Jura-Nord vaudois",5924,"Orges","2006-09-01"]
[14563,"VD",2224,"Jura-Nord vaudois",5925,"Orzens","2006-09-01"]
[14579,"VD",2224,"Jura-Nord vaudois",5926,"Pomy","2006-09-01"]
[14544,"VD",2224,"Jura-Nord vaudois",5928,"Rovray","2006-09-01"]
[14896,"VD",2224,"Jura-Nord vaudois",5929,"Suchy","2006-09-01"]
[14899,"VD",2224,"Jura-Nord vaudois",5930,"Suscévaz","2006-09-01"]
[14878,"VD",2224,"Jura-Nord vaudois",5931,"Treycovagnes","2006-09-01"]
[14870,"VD",2224,"Jura-Nord vaudois",5932,"Ursins","2006-09-01"]
[14869,"VD",2224,"Jura-Nord vaudois",5933,"Valeyres-sous-Montagny","2006-09-01"]
[14871,"VD",2224,"Jura-Nord vaudois",5934,"Valeyres-sous-Ursins","2006-09-01"]
[14883,"VD",2224,"Jura-Nord vaudois",5935,"Villars-Epeney","2006-09-01"]
[14906,"VD",2224,"Jura-Nord vaudois",5937,"Vugelles-La Mothe","2006-09-01"]
[15497,"VD",2224,"Jura-Nord vaudois",5938,"Yverdon-les-Bains","2011-07-01"]
[14912,"VD",2224,"Jura-Nord vaudois",5939,"Yvonand","2006-09-01"]
[13228,"VS",2301,"Brig",6002,"Brig-Glis","1972-10-01"]
[12132,"VS",2301,"Brig",6004,"Eggerberg","1848-09-12"]
[15617,"VS",2301,"Brig",6007,"Naters","2013-01-01"]
[13759,"VS",2301,"Brig",6008,"Ried-Brig","1994-01-01"]
[12984,"VS",2301,"Brig",6009,"Simplon","1848-09-12"]
[10560,"VS",2301,"Brig",6010,"Termen","1848-09-12"]
[10159,"VS",2301,"Brig",6011,"Zwischbergen","1848-09-12"]
[11763,"VS",2302,"Conthey",6021,"Ardon","1848-09-12"]
[11418,"VS",2302,"Conthey",6022,"Chamoson","1848-09-12"]
[11635,"VS",2302,"Conthey",6023,"Conthey","1880-01-01"]
[12518,"VS",2302,"Conthey",6024,"Nendaz","1848-09-12"]
[10923,"VS",2302,"Conthey",6025,"Vétroz","1880-01-01"]
[11846,"VS",2303,"Entremont",6032,"Bourg-Saint-Pierre","1848-09-12"]
[12790,"VS",2303,"Entremont",6033,"Liddes","1848-09-12"]
[13134,"VS",2303,"Entremont",6034,"Orsières","1848-09-12"]
[13002,"VS",2303,"Entremont",6035,"Sembrancher","1848-09-12"]
[16601,"VS",2303,"Entremont",6037,"Val de Bagnes","2021-01-01"]
[11883,"VS",2304,"Goms",6052,"Bellwald","1848-09-12"]
[11892,"VS",2304,"Goms",6054,"Binn","1848-09-12"]
[14504,"VS",2304,"Goms",6056,"Ernen","2004-10-01"]
[12018,"VS",2304,"Goms",6057,"Fiesch","1848-09-12"]
[12017,"VS",2304,"Goms",6058,"Fieschertal","1848-09-12"]
[12609,"VS",2304,"Goms",6061,"Lax","1848-09-12"]
[14958,"VS",2304,"Goms",6076,"Obergoms","2009-01-01"]
[16075,"VS",2304,"Goms",6077,"Goms","2017-01-01"]
[11666,"VS",2305,"Hérens",6082,"Ayent","1848-09-12"]
[12255,"VS",2305,"Hérens",6083,"Evolène","1848-09-12"]
[12298,"VS",2305,"Hérens",6084,"Hérémence","1848-09-12"]
[13032,"VS",2305,"Hérens",6087,"Saint-Martin (VS)","1848-09-12"]
[10925,"VS",2305,"Hérens",6089,"Vex","1848-09-12"]
[15485,"VS",2305,"Hérens",6090,"Mont-Noble","2011-01-01"]
[11720,"VS",2306,"Leuk",6101,"Agarn","1848-09-12"]
[11730,"VS",2306,"Leuk",6102,"Albinen","1848-09-12"]
[12307,"VS",2306,"Leuk",6104,"Ergisch","1848-09-12"]
[12656,"VS",2306,"Leuk",6109,"Inden","1848-09-12"]
[15618,"VS",2306,"Leuk",6110,"Leuk","2013-01-01"]
[12777,"VS",2306,"Leuk",6111,"Leukerbad","1848-09-12"]
[12464,"VS",2306,"Leuk",6112,"Oberems","1848-09-12"]
[13035,"VS",2306,"Leuk",6113,"Salgesch","1848-09-12"]
[10938,"VS",2306,"Leuk",6116,"Varen","1848-09-12"]
[14133,"VS",2306,"Leuk",6117,"Guttet-Feschel","2000-10-01"]
[14959,"VS",2306,"Leuk",6118,"Gampel-Bratsch","2009-01-01"]
[15619,"VS",2306,"Leuk",6119,"Turtmann-Unterems","2013-01-01"]
[11850,"VS",2307,"Martigny",6131,"Bovernier","1848-09-12"]
[12089,"VS",2307,"Martigny",6133,"Fully","1848-09-12"]
[12663,"VS",2307,"Martigny",6134,"Isérables","1848-09-12"]
[12767,"VS",2307,"Martigny",6135,"Leytron","1848-09-12"]
[16602,"VS",2307,"Martigny",6136,"Martigny","2021-01-01"]
[12756,"VS",2307,"Martigny",6137,"Martigny-Combe","1900-01-01"]
[12917,"VS",2307,"Martigny",6139,"Riddes","1848-09-12"]
[12871,"VS",2307,"Martigny",6140,"Saillon","1848-09-12"]
[13058,"VS",2307,"Martigny",6141,"Saxon","1848-09-12"]
[10891,"VS",2307,"Martigny",6142,"Trient","1900-01-01"]
[11415,"VS",2308,"Monthey",6151,"Champéry","1848-09-12"]
[11596,"VS",2308,"Monthey",6152,"Collombey-Muraz","1848-09-12"]
[12323,"VS",2308,"Monthey",6153,"Monthey","1848-09-12"]
[13075,"VS",2308,"Monthey",6154,"Port-Valais","1848-09-12"]
[12863,"VS",2308,"Monthey",6155,"Saint-Gingolph","1848-09-12"]
[10897,"VS",2308,"Monthey",6156,"Troistorrents","1848-09-12"]
[10933,"VS",2308,"Monthey",6157,"Val-d'Illiez","1848-09-12"]
[10078,"VS",2308,"Monthey",6158,"Vionnaz","1848-09-12"]
[10372,"VS",2308,"Monthey",6159,"Vouvry","1848-09-12"]
[11807,"VS",2309,"Raron",6172,"Bister","1848-09-12"]
[11808,"VS",2309,"Raron",6173,"Bitsch","1848-09-12"]
[12079,"VS",2309,"Raron",6177,"Grengiols","1848-09-12"]
[14468,"VS",2309,"Raron",6181,"Riederalp","2003-11-01"]
[11675,"VS",2309,"Raron",6191,"Ausserberg","1923-01-01"]
[11818,"VS",2309,"Raron",6192,"Blatten","1848-09-12"]
[11485,"VS",2309,"Raron",6193,"Bürchen","1848-09-12"]
[12151,"VS",2309,"Raron",6194,"Eischoll","1848-09-12"]
[11995,"VS",2309,"Raron",6195,"Ferden","1848-09-12"]
[12686,"VS",2309,"Raron",6197,"Kippel","1848-09-12"]
[12511,"VS",2309,"Raron",6198,"Niedergesteln","1848-09-12"]
[13162,"VS",2309,"Raron",6199,"Raron","1848-09-12"]
[10860,"VS",2309,"Raron",6201,"Unterbäch","1848-09-12"]
[10337,"VS",2309,"Raron",6202,"Wiler (Lötschen)","1848-09-12"]
[14960,"VS",2309,"Raron",6203,"Mörel-Filet","2009-01-01"]
[14961,"VS",2309,"Raron",6204,"Steg-Hohtenn","2009-01-01"]
[15649,"VS",2309,"Raron",6205,"Bettmeralp","2014-01-01"]
[11598,"VS",2310,"Saint-Maurice",6211,"Collonges","1848-09-12"]
[12207,"VS",2310,"Saint-Maurice",6212,"Dorénaz","1848-09-12"]
[12256,"VS",2310,"Saint-Maurice",6213,"Evionnaz","1848-09-12"]
[12010,"VS",2310,"Saint-Maurice",6214,"Finhaut","1848-09-12"]
[12741,"VS",2310,"Saint-Maurice",6215,"Massongex","1848-09-12"]
[15620,"VS",2310,"Saint-Maurice",6217,"Saint-Maurice","2013-01-01"]
[13016,"VS",2310,"Saint-Maurice",6218,"Salvan","1913-01-01"]
[10917,"VS",2310,"Saint-Maurice",6219,"Vernayaz","1913-01-01"]
[10919,"VS",2310,"Saint-Maurice",6220,"Vérossaz","1848-09-12"]
[11396,"VS",2311,"Sierre",6232,"Chalais","1848-09-12"]
[11610,"VS",2311,"Sierre",6235,"Chippis","1848-09-12"]
[12044,"VS",2311,"Sierre",6238,"Grône","1848-09-12"]
[12187,"VS",2311,"Sierre",6239,"Icogne","1905-01-01"]
[12797,"VS",2311,"Sierre",6240,"Lens","1905-01-01"]
[12857,"VS",2311,"Sierre",6246,"Saint-Léonard","1848-09-12"]
[13227,"VS",2311,"Sierre",6248,"Sierre","1972-10-01"]
[14962,"VS",2311,"Sierre",6252,"Anniviers","2009-01-01"]
[16077,"VS",2311,"Sierre",6253,"Crans-Montana","2017-01-01"]
[16603,"VS",2311,"Sierre",6254,"Noble-Contrée","2021-01-01"]
[11758,"VS",2312,"Sion",6261,"Arbaz","1848-09-12"]
[12094,"VS",2312,"Sion",6263,"Grimisuat","1848-09-12"]
[13061,"VS",2312,"Sion",6265,"Savièse","1848-09-12"]
[16076,"VS",2312,"Sion",6266,"Sion","2017-01-01"]
[10907,"VS",2312,"Sion",6267,"Veysonnaz","1848-09-12"]
[11714,"VS",2313,"Visp",6281,"Baltschieder","1848-09-12"]
[12150,"VS",2313,"Visp",6282,"Eisten","1848-09-12"]
[12293,"VS",2313,"Visp",6283,"Embd","1848-09-12"]
[12040,"VS",2313,"Visp",6285,"Grächen","1848-09-12"]
[12598,"VS",2313,"Visp",6286,"Lalden","1848-09-12"]
[13180,"VS",2313,"Visp",6287,"Randa","1848-09-12"]
[14927,"VS",2313,"Visp",6288,"Saas-Almagell","2007-01-01"]
[14928,"VS",2313,"Visp",6289,"Saas-Balen","2007-01-01"]
[14929,"VS",2313,"Visp",6290,"Saas-Fee","2007-01-01"]
[14930,"VS",2313,"Visp",6291,"Saas-Grund","2007-01-01"]
[10375,"VS",2313,"Visp",6292,"St. Niklaus","1870-01-01"]
[10573,"VS",2313,"Visp",6293,"Stalden (VS)","1848-09-12"]
[10574,"VS",2313,"Visp",6294,"Staldenried","1848-09-12"]
[10555,"VS",2313,"Visp",6295,"Täsch","1848-09-12"]
[10877,"VS",2313,"Visp",6296,"Törbel","1848-09-12"]
[13226,"VS",2313,"Visp",6297,"Visp","1972-10-01"]
[10419,"VS",2313,"Visp",6298,"Visperterminen","1848-09-12"]
[10330,"VS",2313,"Visp",6299,"Zeneggen","1848-09-12"]
[10315,"VS",2313,"Visp",6300,"Zermatt","1848-09-12"]
[16089,"NE",2400,"Cant. de Neuchâtel",6404,"Boudry","2018-01-01"]
[16091,"NE",2400,"Cant. de Neuchâtel",6408,"Cortaillod","2018-01-01"]
[16093,"NE",2400,"Cant. de Neuchâtel",6413,"Rochefort","2018-01-01"]
[16094,"NE",2400,"Cant. de Neuchâtel",6416,"Milvignes","2018-01-01"]
[16121,"NE",2400,"Cant. de Neuchâtel",6417,"La Grande Béroche","2018-04-01"]
[16095,"NE",2400,"Cant. de Neuchâtel",6421,"La Chaux-de-Fonds","2018-01-01"]
[16096,"NE",2400,"Cant. de Neuchâtel",6422,"Les Planchettes","2018-01-01"]
[16097,"NE",2400,"Cant. de Neuchâtel",6423,"La Sagne","2018-01-01"]
[16099,"NE",2400,"Cant. de Neuchâtel",6432,"La Brévine","2018-01-01"]
[16100,"NE",2400,"Cant. de Neuchâtel",6433,"Brot-Plamboz","2018-01-01"]
[16101,"NE",2400,"Cant. de Neuchâtel",6434,"Le Cerneux-Péquignot","2018-01-01"]
[16102,"NE",2400,"Cant. de Neuchâtel",6435,"La Chaux-du-Milieu","2018-01-01"]
[16605,"NE",2400,"Cant. de Neuchâtel",6436,"Le Locle","2021-01-01"]
[16104,"NE",2400,"Cant. de Neuchâtel",6437,"Les Ponts-de-Martel","2018-01-01"]
[16105,"NE",2400,"Cant. de Neuchâtel",6451,"Cornaux","2018-01-01"]
[16106,"NE",2400,"Cant. de Neuchâtel",6452,"Cressier (NE)","2018-01-01"]
[16107,"NE",2400,"Cant. de Neuchâtel",6453,"Enges","2018-01-01"]
[16108,"NE",2400,"Cant. de Neuchâtel",6454,"Hauterive (NE)","2018-01-01"]
[16109,"NE",2400,"Cant. de Neuchâtel",6455,"Le Landeron","2018-01-01"]
[16110,"NE",2400,"Cant. de Neuchâtel",6456,"Lignières","2018-01-01"]
[16604,"NE",2400,"Cant. de Neuchâtel",6458,"Neuchâtel","2021-01-01"]
[16112,"NE",2400,"Cant. de Neuchâtel",6459,"Saint-Blaise","2018-01-01"]
[16113,"NE",2400,"Cant. de Neuchâtel",6461,"La Tène","2018-01-01"]
[16115,"NE",2400,"Cant. de Neuchâtel",6487,"Val-de-Ruz","2018-01-01"]
[16116,"NE",2400,"Cant. de Neuchâtel",6504,"La Côte-aux-Fées","2018-01-01"]
[16117,"NE",2400,"Cant. de Neuchâtel",6511,"Les Verrières","2018-01-01"]
[16118,"NE",2400,"Cant. de Neuchâtel",6512,"Val-de-Travers","2018-01-01"]
[11726,"GE",2500,"Cant. de Genève",6601,"Aire-la-Ville","1848-09-12"]
[11776,"GE",2500,"Cant. de Genève",6602,"Anières","1858-01-01"]
[11664,"GE",2500,"Cant. de Genève",6603,"Avully","1848-09-12"]
[11665,"GE",2500,"Cant. de Genève",6604,"Avusy","1848-09-12"]
[11692,"GE",2500,"Cant. de Genève",6605,"Bardonnex","1851-01-01"]
[11880,"GE",2500,"Cant. de Genève",6606,"Bellevue","1855-01-01"]
[11853,"GE",2500,"Cant. de Genève",6607,"Bernex","1850-01-01"]
[11400,"GE",2500,"Cant. de Genève",6608,"Carouge (GE)","1848-09-12"]
[11411,"GE",2500,"Cant. de Genève",6609,"Cartigny","1848-09-12"]
[11387,"GE",2500,"Cant. de Genève",6610,"Céligny","1848-09-12"]
[11439,"GE",2500,"Cant. de Genève",6611,"Chancy","1848-09-12"]
[11431,"GE",2500,"Cant. de Genève",6612,"Chêne-Bougeries","1848-09-12"]
[11535,"GE",2500,"Cant. de Genève",6613,"Chêne-Bourg","1869-01-01"]
[11586,"GE",2500,"Cant. de Genève",6614,"Choulex","1848-09-12"]
[11595,"GE",2500,"Cant. de Genève",6615,"Collex-Bossy","1855-01-01"]
[11597,"GE",2500,"Cant. de Genève",6616,"Collonge-Bellerive","1848-09-12"]
[11599,"GE",2500,"Cant. de Genève",6617,"Cologny","1848-09-12"]
[11651,"GE",2500,"Cant. de Genève",6618,"Confignon","1851-01-01"]
[11569,"GE",2500,"Cant. de Genève",6619,"Corsier (GE)","1858-01-01"]
[11582,"GE",2500,"Cant. de Genève",6620,"Dardagny","1848-09-12"]
[12099,"GE",2500,"Cant. de Genève",6621,"Genève","1931-01-01"]
[12097,"GE",2500,"Cant. de Genève",6622,"Genthod","1848-09-12"]
[12606,"GE",2500,"Cant. de Genève",6623,"Le Grand-Saconnex","1848-09-12"]
[11959,"GE",2500,"Cant. de Genève",6624,"Gy","1851-01-01"]
[12296,"GE",2500,"Cant. de Genève",6625,"Hermance","1848-09-12"]
[12642,"GE",2500,"Cant. de Genève",6626,"Jussy","1851-01-01"]
[12575,"GE",2500,"Cant. de Genève",6627,"Laconnex","1851-01-01"]
[12624,"GE",2500,"Cant. de Genève",6628,"Lancy","1848-09-12"]
[12409,"GE",2500,"Cant. de Genève",6629,"Meinier","1848-09-12"]
[12430,"GE",2500,"Cant. de Genève",6630,"Meyrin","1848-09-12"]
[12484,"GE",2500,"Cant. de Genève",6631,"Onex","1851-01-01"]
[13155,"GE",2500,"Cant. de Genève",6632,"Perly-Certoux","1848-09-12"]
[13114,"GE",2500,"Cant. de Genève",6633,"Plan-les-Ouates","1851-01-01"]
[13110,"GE",2500,"Cant. de Genève",6634,"Pregny-Chambésy","1952-01-01"]
[13107,"GE",2500,"Cant. de Genève",6635,"Presinge","1851-01-01"]
[13094,"GE",2500,"Cant. de Genève",6636,"Puplinge","1851-01-01"]
[12872,"GE",2500,"Cant. de Genève",6637,"Russin","1848-09-12"]
[13051,"GE",2500,"Cant. de Genève",6638,"Satigny","1848-09-12"]
[10414,"GE",2500,"Cant. de Genève",6639,"Soral","1851-01-01"]
[10569,"GE",2500,"Cant. de Genève",6640,"Thônex","1869-01-01"]
[10896,"GE",2500,"Cant. de Genève",6641,"Troinex","1848-09-12"]
[10942,"GE",2500,"Cant. de Genève",6642,"Vandoeuvres","1848-09-12"]
[10918,"GE",2500,"Cant. de Genève",6643,"Vernier","1848-09-12"]
[10921,"GE",2500,"Cant. de Genève",6644,"Versoix","1848-09-12"]
[10902,"GE",2500,"Cant. de Genève",6645,"Veyrier","1848-09-12"]
[13273,"JU",2601,"Delémont",6702,"Boécourt","1979-01-01"]
[13274,"JU",2601,"Delémont",6703,"Bourrignon","1979-01-01"]
[13275,"JU",2601,"Delémont",6704,"Châtillon (JU)","1979-01-01"]
[13277,"JU",2601,"Delémont",6706,"Courchapoix","1979-01-01"]
[16127,"JU",2601,"Delémont",6708,"Courrendlin","2019-01-01"]
[13280,"JU",2601,"Delémont",6709,"Courroux","1979-01-01"]
[13281,"JU",2601,"Delémont",6710,"Courtételle","1979-01-01"]
[13282,"JU",2601,"Delémont",6711,"Delémont","1979-01-01"]
[13283,"JU",2601,"Delémont",6712,"Develier","1979-01-01"]
[13284,"JU",2601,"Delémont",6713,"Ederswiler","1979-01-01"]
[13286,"JU",2601,"Delémont",6715,"Mervelier","1979-01-01"]
[13680,"JU",2601,"Delémont",6716,"Mettembert","1984-01-01"]
[13289,"JU",2601,"Delémont",6718,"Movelier","1979-01-01"]
[13290,"JU",2601,"Delémont",6719,"Pleigne","1979-01-01"]
[13292,"JU",2601,"Delémont",6721,"Rossemaison","1979-01-01"]
[13293,"JU",2601,"Delémont",6722,"Saulcy","1979-01-01"]
[13295,"JU",2601,"Delémont",6724,"Soyhières","1979-01-01"]
[15624,"JU",2601,"Delémont",6729,"Haute-Sorne","2013-01-01"]
[16119,"JU",2601,"Delémont",6730,"Val Terbi","2018-01-01"]
[13299,"JU",2602,"Les Franches-Montagnes",6741,"Le Bémont (JU)","1979-01-01"]
[13300,"JU",2602,"Les Franches-Montagnes",6742,"Les Bois","1979-01-01"]
[13301,"JU",2602,"Les Franches-Montagnes",6743,"Les Breuleux","1979-01-01"]
[13302,"JU",2602,"Les Franches-Montagnes",6744,"La Chaux-des-Breuleux","1979-01-01"]
[13303,"JU",2602,"Les Franches-Montagnes",6745,"Les Enfers","1979-01-01"]
[13306,"JU",2602,"Les Franches-Montagnes",6748,"Les Genevez (JU)","1979-01-01"]
[13308,"JU",2602,"Les Franches-Montagnes",6750,"Lajoux (JU)","1979-01-01"]
[14967,"JU",2602,"Les Franches-Montagnes",6751,"Montfaucon","2009-01-01"]
[14968,"JU",2602,"Les Franches-Montagnes",6753,"Muriaux","2009-01-01"]
[13312,"JU",2602,"Les Franches-Montagnes",6754,"Le Noirmont","1979-01-01"]
[14966,"JU",2602,"Les Franches-Montagnes",6757,"Saignelégier","2009-01-01"]
[13316,"JU",2602,"Les Franches-Montagnes",6758,"Saint-Brais","1979-01-01"]
[13317,"JU",2602,"Les Franches-Montagnes",6759,"Soubey","1979-01-01"]
[13318,"JU",2603,"Porrentruy",6771,"Alle","1979-01-01"]
[13320,"JU",2603,"Porrentruy",6773,"Beurnevésin","1979-01-01"]
[13321,"JU",2603,"Porrentruy",6774,"Boncourt","1979-01-01"]
[13322,"JU",2603,"Porrentruy",6775,"Bonfol","1979-01-01"]
[13325,"JU",2603,"Porrentruy",6778,"Bure","1979-01-01"]
[13328,"JU",2603,"Porrentruy",6781,"Coeuve","1979-01-01"]
[13329,"JU",2603,"Porrentruy",6782,"Cornol","1979-01-01"]
[13330,"JU",2603,"Porrentruy",6783,"Courchavon","1979-01-01"]
[13331,"JU",2603,"Porrentruy",6784,"Courgenay","1979-01-01"]
[13332,"JU",2603,"Porrentruy",6785,"Courtedoux","1979-01-01"]
[13334,"JU",2603,"Porrentruy",6787,"Damphreux","1979-01-01"]
[13336,"JU",2603,"Porrentruy",6789,"Fahy","1979-01-01"]
[15626,"JU",2603,"Porrentruy",6790,"Fontenais","2013-01-01"]
[13339,"JU",2603,"Porrentruy",6792,"Grandfontaine","1979-01-01"]
[13340,"JU",2603,"Porrentruy",6793,"Lugnez","1979-01-01"]
[13347,"JU",2603,"Porrentruy",6800,"Porrentruy","1979-01-01"]
[13353,"JU",2603,"Porrentruy",6806,"Vendlincourt","1979-01-01"]
[14970,"JU",2603,"Porrentruy",6807,"Basse-Allaine","2009-01-01"]
[14965,"JU",2603,"Porrentruy",6808,"Clos du Doubs","2009-01-01"]
[16120,"JU",2603,"Porrentruy",6809,"Haute-Ajoie","2018-01-01"]
[14969,"JU",2603,"Porrentruy",6810,"La Baroche","2009-01-01"]

{"sheet":"SLT-Leistungsklasse","index":7,"n_rows":294,"n_cols":10,"rows_kept":294,"cut":false,"hidden":true,"merged":[]}
["Dropdown-Text","SL-Träger-ID","SLTNAME","GEMEINDE_ID","Gemeinde","Asylsuchende","Flüchtlinge","Sort","Ausgeblendet","Neu 2022"]
["14288 : Adlikon (Fürsorgebehörde Andelfingen)",14288,"Fürsorgebehörde Andelfingen",21,"Adlikon",null,"x",55,"","×"]
["13006 : Stadt Adliswil",13006,"Stadt Adliswil",131,"Adliswil","x","x",284,"",""]
["11286 : Gemeindeverwaltung Aesch",11286,"Gemeindeverwaltung Aesch",241,"Aesch (ZH)",null,"x",98,"",""]
["11088 : Affoltern am Albis (Gemeindeverwaltung Affoltern am Albis)",11088,"Gemeindeverwaltung Affoltern am Albis",2,"Affoltern am Albis",null,"x",101,"","×"]
["11059 : Altikon (Gemeindeverwaltung Seuzach)",11059,"Gemeindeverwaltung Seuzach",211,"Altikon","x","x",159,"",""]
["14288 : Andelfingen (Fürsorgebehörde Andelfingen)",14288,"Fürsorgebehörde Andelfingen",30,"Andelfingen",null,"x",56,"","×"]
["11009 : Gemeinde Bachenbülach",11009,"Gemeinde Bachenbülach",51,"Bachenbülach","x","x",59,"",""]
["14005 : Bachs (Gemeinde Steinmaur)",14005,"Gemeinde Steinmaur",81,"Bachs","x","x",83,"",""]
["11290 : Gemeinde Bäretswil",11290,"Gemeinde Bäretswil",111,"Bäretswil",null,"x",60,"",""]
["11291 : Gemeinde Bassersdorf",11291,"Gemeinde Bassersdorf",52,"Bassersdorf","x","x",61,"",""]
["11292 : Gemeinde Bauma",11292,"Gemeinde Bauma",297,"Bauma","x","x",62,"",""]
["11293 : Gemeindeverwaltung Benken",11293,"Gemeindeverwaltung Benken",22,"Benken (ZH)",null,"x",102,"",""]
["11010 : Gemeindeverwaltung Berg am Irchel",11010,"Gemeindeverwaltung Berg am Irchel",23,"Berg am Irchel",null,"x",97,"",""]
["13011 : Gemeindeverwaltung Birmensdorf",13011,"Gemeindeverwaltung Birmensdorf",242,"Birmensdorf (ZH)","x","x",103,"",""]
["11295 : Gemeindeverwaltung Boppelsen",11295,"Gemeindeverwaltung Boppelsen",82,"Boppelsen","x","x",104,"",""]
["11059 : Brütten (Gemeindeverwaltung Seuzach)",11059,"Gemeindeverwaltung Seuzach",213,"Brütten","x","x",160,"",""]
["13013 : Gemeinde Bubikon",13013,"Gemeinde Bubikon",112,"Bubikon","x","x",63,"",""]
["11014 : Gemeindeverwaltung Buch am Irchel",11014,"Gemeindeverwaltung Buch am Irchel",24,"Buch am Irchel",null,"x",105,"",""]
["11297 : Gemeindeverwaltung Buchs ",11297,"Gemeindeverwaltung Buchs ",83,"Buchs (ZH)",null,"x",106,"",""]
["11375 : Gemeinde Dachsen ",11375,"Gemeinde Dachsen ",25,"Dachsen",null,"x",64,"",""]
["11016 : Gemeinde Dägerlen",11016,"Gemeinde Dägerlen",214,"Dägerlen","x","x",65,"",""]
["11300 : Gemeinde Dänikon ",11300,"Gemeinde Dänikon ",85,"Dänikon",null,"x",66,"",""]
["11301 : Gemeindeverwaltung Dättlikon",11301,"Gemeindeverwaltung Dättlikon",215,"Dättlikon","x","x",107,"",""]
["11017 : Gemeindeverwaltung Dielsdorf",11017,"Gemeindeverwaltung Dielsdorf",86,"Dielsdorf","x","x",108,"",""]
["13018 : Stadt Dietikon",13018,"Stadt Dietikon",243,"Dietikon","x","x",285,"",""]
["13019 : Gemeindeverwaltung Dietlikon",13019,"Gemeindeverwaltung Dietlikon",54,"Dietlikon","x","x",109,"",""]
["11059 : Dinhard (Gemeindeverwaltung Seuzach)",11059,"Gemeindeverwaltung Seuzach",216,"Dinhard","x","x",161,"",""]
["11302 : Gemeindekanzlei Dorf",11302,"Gemeindekanzlei Dorf",26,"Dorf",null,"x",96,"",""]
["13021 : Stadt Dübendorf",13021,"Stadt Dübendorf",191,"Dübendorf",null,"x",286,"",""]
["11022 : Gemeinde Dürnten",11022,"Gemeinde Dürnten",113,"Dürnten","x","x",67,"",""]
["11303 : Gemeinde Egg ",11303,"Gemeinde Egg ",192,"Egg",null,"x",68,"",""]
["12023 : Gemeindeverwaltung Eglisau",12023,"Gemeindeverwaltung Eglisau",55,"Eglisau","x","x",110,"",""]
["11304 : Gemeindeverwaltung Ellikon an der Thur ",11304,"Gemeindeverwaltung Ellikon an der Thur ",218,"Ellikon an der Thur",null,"x",111,"",""]
["11305 : Gemeindeverwaltung Embrach",11305,"Gemeindeverwaltung Embrach",56,"Embrach","x","x",112,"",""]
["11306 : Gemeindeverwaltung Erlenbach",11306,"Gemeindeverwaltung Erlenbach",151,"Erlenbach (ZH)","x","x",113,"",""]
["11307 : Gemeindeverwaltung Fällanden",11307,"Gemeindeverwaltung Fällanden",193,"Fällanden","x","x",114,"",""]
["13712 : Gemeindeverwaltung Fehraltorf",13712,"Gemeindeverwaltung Fehraltorf",172,"Fehraltorf","x","x",115,"",""]
["11025 : Gemeindeverwaltung Feuerthalen",11025,"Gemeindeverwaltung Feuerthalen",27,"Feuerthalen",null,"x",116,"",""]
["11308 : Gemeindeverwaltung Fischenthal",11308,"Gemeindeverwaltung Fischenthal",114,"Fischenthal",null,"x",117,"",""]
["11309 : Gemeindeverwaltung Flaach",11309,"Gemeindeverwaltung Flaach",28,"Flaach",null,"x",118,"",""]
["11310 : Gemeinde Flurlingen",11310,"Gemeinde Flurlingen",29,"Flurlingen",null,"x",69,"",""]
["11311 : Gemeindeverwaltung Freienstein-Teufen",11311,"Gemeindeverwaltung Freienstein-Teufen",57,"Freienstein-Teufen","x","x",119,"",""]
["11312 : Gemeindeverwaltung Geroldswil",11312,"Gemeindeverwaltung Geroldswil",244,"Geroldswil","x","x",120,"",""]
["11313 : Gemeindeverwaltung Glattfelden",11313,"Gemeindeverwaltung Glattfelden",58,"Glattfelden",null,"x",121,"",""]
["11026 : Gemeindeverwaltung Gossau",11026,"Gemeindeverwaltung Gossau",115,"Gossau (ZH)","x","x",122,"",""]
["11314 : Gemeindeverwaltung Greifensee",11314,"Gemeindeverwaltung Greifensee",194,"Greifensee","x","x",123,"",""]
["11027 : Gemeindeverwaltung Grüningen",11027,"Gemeindeverwaltung Grüningen",116,"Grüningen","x","x",124,"",""]
["11315 : Gemeindeverwaltung Hagenbuch",11315,"Gemeindeverwaltung Hagenbuch",220,"Hagenbuch","x","x",125,"",""]
["11316 : Gemeindeverwaltung Henggart",11316,"Gemeindeverwaltung Henggart",31,"Henggart",null,"x",126,"",""]
["11030 : Gemeinde Herrliberg",11030,"Gemeinde Herrliberg",152,"Herrliberg","x","x",70,"",""]
["11317 : Gemeindeverwaltung Hettlingen",11317,"Gemeindeverwaltung Hettlingen",221,"Hettlingen","x","x",127,"",""]
["11086 : Gemeindeverwaltung Hinwil",11086,"Gemeindeverwaltung Hinwil",117,"Hinwil","x","x",128,"",""]
["13032 : Gemeinde Hombrechtikon ",13032,"Gemeinde Hombrechtikon ",153,"Hombrechtikon","x","x",71,"","×"]
["11033 : Gemeindeverwaltung Horgen",11033,"Gemeindeverwaltung Horgen",295,"Horgen","x","x",129,"",""]
["11321 : Gemeinde Höri",11321,"Gemeinde Höri",60,"Höri","x","x",72,"",""]
["14288 : Humlikon (Fürsorgebehörde Andelfingen)",14288,"Fürsorgebehörde Andelfingen",32,"Humlikon",null,"x",58,"","×"]
["11323 : Gemeindeverwaltung Hüntwangen",11323,"Gemeindeverwaltung Hüntwangen",61,"Hüntwangen","x","x",130,"",""]
["11035 : Gemeindeverwaltung Hüttikon",11035,"Gemeindeverwaltung Hüttikon",87,"Hüttikon","x","x",131,"",""]
["13136 : Stadt Illnau-Effretikon",13136,"Stadt Illnau-Effretikon",296,"Illnau-Effretikon","x","x",287,"",""]
["17345 : Gemeindeverwaltung Affoltern a. A. ",17345,"Gemeindeverwaltung Affoltern a. A. ",6,"Kappel am Albis",null,"x",100,"","×"]
["13037 : Gemeindeverwaltung Kilchberg",13037,"Gemeindeverwaltung Kilchberg",135,"Kilchberg (ZH)","x","x",132,"",""]
["14288 : Kleinandelfingen (Fürsorgebehörde Andelfingen)",14288,"Fürsorgebehörde Andelfingen",33,"Kleinandelfingen",null,"x",57,"","×"]
["13038 : Stadt Kloten",13038,"Stadt Kloten",62,"Kloten","x","x",288,"",""]
["13002 : Gemeindeverwaltung Küsnacht",13002,"Gemeindeverwaltung Küsnacht",154,"Küsnacht (ZH)","x","x",133,"",""]
["11003 : Gemeindeverwaltung Langnau am Albis",11003,"Gemeindeverwaltung Langnau am Albis",136,"Langnau am Albis","x","x",134,"",""]
["11390 : Finanzverwaltung Laufen-Uhwiesen",11390,"Finanzverwaltung Laufen-Uhwiesen",34,"Laufen-Uhwiesen",null,"x",52,"",""]
["13703 : Sozialamt Gemeinde Lindau",13703,"Sozialamt Gemeinde Lindau",176,"Lindau","x","x",230,"","×"]
["11329 : Gemeindeverwaltung Lufingen",11329,"Gemeindeverwaltung Lufingen",63,"Lufingen","x","x",135,"",""]
["13039 : Gemeinde Männedorf",13039,"Gemeinde Männedorf",155,"Männedorf","x","x",73,"",""]
["11330 : Gemeinde Marthalen",11330,"Gemeinde Marthalen",35,"Marthalen",null,"x",74,"",""]
["11332 : Gemeinde Maur",11332,"Gemeinde Maur",195,"Maur","x","x",75,"",""]
["13087 : Sozialamt Meilen",13087,"Sozialamt Meilen",156,"Meilen","x","x",231,"",""]
["11041 : Gemeindeverwaltung Mönchaltorf",11041,"Gemeindeverwaltung Mönchaltorf",196,"Mönchaltorf","x","x",136,"",""]
["11042 : Gemeindeverwaltung Neerach",11042,"Gemeindeverwaltung Neerach",88,"Neerach","x","x",137,"",""]
["12043 : Gemeindeverwaltung Neftenbach",12043,"Gemeindeverwaltung Neftenbach",223,"Neftenbach","x","x",138,"",""]
["11333 : Gemeindeverwaltung Niederglatt",11333,"Gemeindeverwaltung Niederglatt",89,"Niederglatt","x","x",139,"",""]
["11044 : Gemeinde Niederhasli",11044,"Gemeinde Niederhasli",90,"Niederhasli",null,"x",76,"",""]
["12045 : Gemeindeverwaltung Niederweningen",12045,"Gemeindeverwaltung Niederweningen",91,"Niederweningen","x","x",140,"",""]
["11334 : Gemeinde Nürensdorf",11334,"Gemeinde Nürensdorf",64,"Nürensdorf","x","x",77,"",""]
["11335 : Gemeindeverwaltung Oberembrach",11335,"Gemeindeverwaltung Oberembrach",65,"Oberembrach",null,"x",141,"",""]
["11336 : Sozialdienst Oberengstringen",11336,"Sozialdienst Oberengstringen",245,"Oberengstringen","x","x",281,"",""]
["11337 : Gemeinde Oberglatt",11337,"Gemeinde Oberglatt",92,"Oberglatt","x","x",78,"",""]
["11338 : Gemeinde Oberrieden",11338,"Gemeinde Oberrieden",137,"Oberrieden","x","x",79,"",""]
["14005 : Oberweningen (Gemeinde Steinmaur)",14005,"Gemeinde Steinmaur",93,"Oberweningen","x","x",84,"",""]
["11341 : Gemeindeverwaltung Oetwil am See",11341,"Gemeindeverwaltung Oetwil am See",157,"Oetwil am See","x","x",142,"",""]
["12047 : Gemeindeverwaltung Oetwil an der Limmat ",12047,"Gemeindeverwaltung Oetwil an der Limmat ",246,"Oetwil an der Limmat","x","x",143,"",""]
["13048 : Stadt Opfikon",13048,"Stadt Opfikon",66,"Opfikon",null,"x",289,"",""]
["12049 : Gemeindeverwaltung Ossingen",12049,"Gemeindeverwaltung Ossingen",37,"Ossingen",null,"x",144,"",""]
["11342 : Gemeindeverwaltung Otelfingen",11342,"Gemeindeverwaltung Otelfingen",94,"Otelfingen",null,"x",145,"",""]
["13051 : Gemeindeverwaltung Pfäffikon ZH",13051,"Gemeindeverwaltung Pfäffikon ZH",177,"Pfäffikon","x","x",146,"",""]
["12085 : Gemeindeverwaltung Pfungen",12085,"Gemeindeverwaltung Pfungen",224,"Pfungen","x","x",147,"",""]
["11343 : Gemeindeverwaltung Rafz",11343,"Gemeindeverwaltung Rafz",67,"Rafz","x","x",148,"",""]
["14005 : Regensberg (Gemeinde Steinmaur)",14005,"Gemeinde Steinmaur",95,"Regensberg","x","x",85,"",""]
["13052 : Gemeindeverwaltung Regensdorf",13052,"Gemeindeverwaltung Regensdorf",96,"Regensdorf","x","x",149,"",""]
["11345 : Gemeinde Rheinau",11345,"Gemeinde Rheinau",38,"Rheinau",null,"x",80,"",""]
["13053 : Gemeindeverwaltung Richterswil",13053,"Gemeindeverwaltung Richterswil",138,"Richterswil","x","x",150,"",""]
["11346 : Gemeindeverwaltung Rickenbach",11346,"Gemeindeverwaltung Rickenbach",225,"Rickenbach (ZH)","x","x",151,"",""]
["17346 : Rifferswil (Gemeindeverwaltung Affoltern a. A.)",17346,"Gemeindeverwaltung Affoltern a. A.",12,"Rifferswil",null,"x",99,"","×"]
["11348 : Gemeindeverwaltung Rorbas",11348,"Gemeindeverwaltung Rorbas",68,"Rorbas",null,"x",152,"",""]
["11054 : Gemeindeverwaltung Rümlang",11054,"Gemeindeverwaltung Rümlang",97,"Rümlang","x","x",153,"",""]
["11055 : Gemeindeverwaltung Rüschlikon",11055,"Gemeindeverwaltung Rüschlikon",139,"Rüschlikon","x","x",154,"",""]
["13056 : Gemeinde Russikon",13056,"Gemeinde Russikon",178,"Russikon","x","x",81,"",""]
["13057 : Gemeinde Rüti",13057,"Gemeinde Rüti",118,"Rüti (ZH)","x","x",82,"",""]
["11349 : Gemeindeverwaltung Schlatt (ZH)",11349,"Gemeindeverwaltung Schlatt (ZH)",226,"Schlatt (ZH)","x","x",155,"",""]
["14005 : Schleinikon (Gemeinde Steinmaur)",14005,"Gemeinde Steinmaur",98,"Schleinikon","x","x",86,"",""]
["13058 : Stadtverwaltung Schlieren",13058,"Stadtverwaltung Schlieren",247,"Schlieren","x","x",293,"",""]
["11351 : Gemeindeverwaltung Schöfflisdorf",11351,"Gemeindeverwaltung Schöfflisdorf",99,"Schöfflisdorf","x","x",156,"",""]
["11353 : Gemeindeverwaltung Schwerzenbach",11353,"Gemeindeverwaltung Schwerzenbach",197,"Schwerzenbach",null,"x",157,"",""]
["11354 : Gemeindeverwaltung Seegräben",11354,"Gemeindeverwaltung Seegräben",119,"Seegräben",null,"x",158,"",""]
["11059 : Seuzach (Gemeindeverwaltung Seuzach)",11059,"Gemeindeverwaltung Seuzach",227,"Seuzach","x","x",162,"",""]
["11355 : Gemeindeverwaltung Stadel",11355,"Gemeindeverwaltung Stadel",100,"Stadel",null,"x",163,"",""]
["13060 : Gemeindeverwaltung Stäfa",13060,"Gemeindeverwaltung Stäfa",158,"Stäfa","x","x",164,"",""]
["14005 : Steinmaur (Gemeinde Steinmaur)",14005,"Gemeinde Steinmaur",101,"Steinmaur","x","x",87,"",""]
["13062 : Gemeindeverwaltung Thalwil",13062,"Gemeindeverwaltung Thalwil",141,"Thalwil","x","x",165,"",""]
["13713 : Gemeindeverwaltung Trüllikon",13713,"Gemeindeverwaltung Trüllikon",40,"Trüllikon",null,"x",166,"",""]
["11358 : Gemeindeverwaltung Truttikon ",11358,"Gemeindeverwaltung Truttikon ",41,"Truttikon",null,"x",167,"",""]
["13063 : Gemeindeverwaltung Turbenthal",13063,"Gemeindeverwaltung Turbenthal",228,"Turbenthal","x","x",168,"",""]
["13064 : Gemeinde Uetikon am See",13064,"Gemeinde Uetikon am See",159,"Uetikon am See","x","x",88,"",""]
["11264 : Gemeinde Uitikon",11264,"Gemeinde Uitikon",248,"Uitikon","x","x",89,"",""]
["13067 : Sozialamt Urdorf",13067,"Sozialamt Urdorf",250,"Urdorf","x","x",232,"",""]
["13068 : Stadt Uster",13068,"Stadt Uster",198,"Uster","x","x",290,"",""]
["12069 : Gemeindeverwaltung Volken",12069,"Gemeindeverwaltung Volken",43,"Volken",null,"x",169,"",""]
["11070 : Gemeindeverwaltung Volketswil",11070,"Gemeindeverwaltung Volketswil",199,"Volketswil",null,"x",170,"",""]
["13071 : Stadt Wädenswil",13071,"Stadt Wädenswil",293,"Wädenswil","x","x",291,"",""]
["13072 : Gemeinde Wald",13072,"Gemeinde Wald",120,"Wald (ZH)","x","x",90,"",""]
["13073 : Gemeinde Wallisellen",13073,"Gemeinde Wallisellen",69,"Wallisellen","x","x",91,"",""]
["11075 : Gemeindeverwaltung Wangen-Brüttisellen",11075,"Gemeindeverwaltung Wangen-Brüttisellen",200,"Wangen-Brüttisellen","x","x",171,"",""]
["11360 : Gemeindeverwaltung Wasterkingen",11360,"Gemeindeverwaltung Wasterkingen",70,"Wasterkingen","x","x",172,"",""]
["11366 : Gemeinde Weiach",11366,"Gemeinde Weiach",102,"Weiach",null,"x",92,"",""]
["13076 : Gemeindeverwaltung Weiningen",13076,"Gemeindeverwaltung Weiningen",251,"Weiningen (ZH)","x","x",173,"",""]
["11362 : Gemeinde Weisslingen",11362,"Gemeinde Weisslingen",180,"Weisslingen","x","x",93,"",""]
["13078 : Stadt Wetzikon",13078,"Stadt Wetzikon",121,"Wetzikon (ZH)","x","x",292,"",""]
["12004 : Gemeindeverwaltung Wiesendangen",12004,"Gemeindeverwaltung Wiesendangen",298,"Wiesendangen","x","x",174,"",""]
["12079 : Gemeindeverwaltung Wil ZH",12079,"Gemeindeverwaltung Wil ZH",71,"Wil (ZH)","x","x",175,"",""]
["11363 : Gemeinde Wila",11363,"Gemeinde Wila",181,"Wila","x","x",94,"",""]
["11364 : Gemeindeverwaltung Wildberg",11364,"Gemeindeverwaltung Wildberg",182,"Wildberg","x","x",176,"",""]
["11080 : Gemeindeverwaltung Winkel",11080,"Gemeindeverwaltung Winkel",72,"Winkel",null,"x",177,"",""]
["13081 : Soziale Dienste Winterthur",13081,"Soziale Dienste Winterthur",230,"Winterthur","x","x",282,"",""]
["11082 : Gemeindeverwaltung Zell",11082,"Gemeindeverwaltung Zell",231,"Zell (ZH)",null,"x",178,"",""]
["13083 : Gemeinde Zollikon",13083,"Gemeinde Zollikon",161,"Zollikon","x","x",95,"",""]
["13084 : Soziale Dienste Zürich",13084,"Soziale Dienste Zürich",261,"Zürich","x","x",283,"",""]
["17327 : AOZ Affoltern am Albis",17327,"AOZ Affoltern am Albis",2,"Affoltern am Albis","x","x",2,"AOZ",""]
["14480 : AOZ MNA Zentrum Lilienberg",14480,"AOZ MNA Zentrum Lilienberg",2,"Affoltern am Albis","x","x",31,"AOZ",""]
["17333 : AOZ Altikon",17333,"AOZ Altikon",211,"Altikon","x","x",3,"AOZ",""]
["14429 : AOZ Bäretswil",14429,"AOZ Bäretswil",111,"Bäretswil","x","x",4,"AOZ",""]
["14423 : AOZ Bauma",14423,"AOZ Bauma",297,"Bauma","x","x",5,"AOZ",""]
["17337 : AOZ Birmensdorf",17337,"AOZ Birmensdorf",242,"Birmensdorf (ZH)","x",null,6,"AOZ",""]
["17328 : Brütten (AOZ Brütten)",17328,"AOZ Brütten",213,"Brütten","x","x",1,"AOZ","×"]
["14471 : AOZ Bubikon",14471,"AOZ Bubikon",112,"Bubikon","x","x",7,"AOZ",""]
["17338 : AOZ Buchs",17338,"AOZ Buchs",83,"Buchs (ZH)","x",null,8,"AOZ",""]
["17339 : AOZ Dällikon",17339,"AOZ Dällikon",84,"Dällikon","x","x",9,"AOZ",""]
["17340 : AOZ Dietikon",17340,"AOZ Dietikon",243,"Dietikon","x",null,10,"AOZ",""]
["14414 : AOZ Dietlikon",14414,"AOZ Dietlikon",54,"Dietlikon","x","x",11,"AOZ",""]
["17329 : AOZ Dinhard",17329,"AOZ Dinhard",216,"Dinhard","x","x",12,"AOZ",""]
["14501 : AOZ Dürnten",14501,"AOZ Dürnten",113,"Dürnten","x","x",13,"AOZ",""]
["17332 : AOZ Elgg",17332,"AOZ Elgg",294,"Elgg","x","x",18,"AOZ",""]
["14469 : AOZ Erlenbach",14469,"AOZ Erlenbach",151,"Erlenbach (ZH)","x","x",19,"AOZ",""]
["14416 : AOZ Fischenthal",14416,"AOZ Fischenthal",114,"Fischenthal","x","x",20,"AOZ",""]
["14432 : AOZ Geroldswil",14432,"AOZ Geroldswil",244,"Geroldswil","x","x",22,"AOZ",""]
["17344 : AOZ Glattfelden",17344,"AOZ Glattfelden",58,"Glattfelden","x",null,23,"AOZ",""]
["14417 : AOZ Gossau",14417,"AOZ Gossau",115,"Gossau (ZH)","x","x",24,"AOZ",""]
["14460 : AOZ Hinwil",14460,"AOZ Hinwil",117,"Hinwil","x","x",25,"AOZ",""]
["14413 : AOZ Hittnau",14413,"AOZ Hittnau",173,"Hittnau","x","x",26,"AOZ",""]
["17324 : AOZ Kappel a. A. ",17324,"AOZ Kappel a. A. ",6,"Kappel am Albis","x","x",27,"AOZ",""]
["17330 : AOZ Kilchberg",17330,"AOZ Kilchberg",135,"Kilchberg (ZH)","x","x",28,"AOZ",""]
["14467 : AOZ Kloten",14467,"AOZ Kloten",62,"Kloten","x",null,29,"AOZ",""]
["14428 : AOZ Küsnacht",14428,"AOZ Küsnacht",154,"Küsnacht (ZH)","x",null,30,"AOZ",""]
["17343 : AOZ Mönchaltdorf",17343,"AOZ Mönchaltdorf",196,"Mönchaltorf","x",null,32,"AOZ",""]
["17341 : AOZ Niederhasli",17341,"AOZ Niederhasli",90,"Niederhasli","x",null,33,"AOZ",""]
["14481 : Oberembrach (AOZ DZ im Auftrag des Kantonalen Sozialamtes Zürich)",14481,"AOZ DZ im Auftrag des Kantonalen Sozialamtes Zürich",65,"Oberembrach","x","x",14,"AOZ",""]
["14461 : AOZ Oetwil an der Limmat",14461,"AOZ Oetwil an der Limmat",246,"Oetwil an der Limmat","x",null,34,"AOZ",""]
["14420 : AOZ Opfikon",14420,"AOZ Opfikon",66,"Opfikon","x","x",35,"AOZ",""]
["14462 : AOZ Pfäffikon",14462,"AOZ Pfäffikon",177,"Pfäffikon","x","x",36,"AOZ",""]
["17325 : AOZ Rifferswil ",17325,"AOZ Rifferswil ",12,"Rifferswil","x","x",37,"AOZ",""]
["14463 : AOZ Rüti ZH",14463,"AOZ Rüti ZH",118,"Rüti (ZH)","x",null,38,"AOZ",""]
["14421 : AOZ Schlieren",14421,"AOZ Schlieren",247,"Schlieren","x","x",39,"AOZ",""]
["14422 : AOZ Schwerzenbach",14422,"AOZ Schwerzenbach",197,"Schwerzenbach","x","x",40,"AOZ",""]
["14430 : AOZ Seegräben",14430,"AOZ Seegräben",119,"Seegräben","x","x",41,"AOZ",""]
["17342 : AOZ Seuzach",17342,"AOZ Seuzach",227,"Seuzach","x",null,42,"AOZ",""]
["14424 : AOZ Unterengstringen",14424,"AOZ Unterengstringen",249,"Unterengstringen","x","x",43,"AOZ",""]
["14481 : Volketswil (AOZ DZ im Auftrag des Kantonalen Sozialamtes Zürich)",14481,"AOZ DZ im Auftrag des Kantonalen Sozialamtes Zürich",199,"Volketswil","x","x",16,"AOZ",""]
["14425 : AOZ Volketswil",14425,"AOZ Volketswil",199,"Volketswil","x","x",44,"AOZ",""]
["14464 : AOZ Wald",14464,"AOZ Wald",120,"Wald (ZH)","x","x",45,"AOZ",""]
["14426 : AOZ Wangen-Brüttisellen",14426,"AOZ Wangen-Brüttisellen",200,"Wangen-Brüttisellen","x","x",46,"AOZ",""]
["14465 : AOZ Weiningen",14465,"AOZ Weiningen",251,"Weiningen (ZH)","x","x",47,"AOZ",""]
["14466 : AOZ Wetzikon",14466,"AOZ Wetzikon",121,"Wetzikon (ZH)","x","x",48,"AOZ",""]
["14434 : AOZ Winkel",14434,"AOZ Winkel",72,"Winkel","x","x",49,"AOZ",""]
["14481 : Zell (ZH) (AOZ DZ im Auftrag des Kantonalen Sozialamtes Zürich)",14481,"AOZ DZ im Auftrag des Kantonalen Sozialamtes Zürich",231,"Zell (ZH)","x","x",15,"AOZ",""]
["14427 : AOZ Zumikon",14427,"AOZ Zumikon",160,"Zumikon","x","x",50,"AOZ",""]
["14481 : Zürich (AOZ DZ im Auftrag des Kantonalen Sozialamtes Zürich)",14481,"AOZ DZ im Auftrag des Kantonalen Sozialamtes Zürich",261,"Zürich","x","x",17,"AOZ",""]
["14490 : AOZ Flüchtlingswohnen",14490,"AOZ Flüchtlingswohnen",261,"Zürich","x","x",21,"AOZ",""]
["14407 : AOZ Zürich",14407,"AOZ Zürich",261,"Zürich","x","x",51,"AOZ",""]
["17318 : Adlikon (Sozialdienst Asyl, Winterthur)",17318,"Sozialdienst Asyl, Winterthur",21,"Adlikon","x","x",233,"Asyl/Bezirk",""]
["14007 : Aeugst am Albis (Sozialdienst Bezirk Affoltern)",14007,"Sozialdienst Bezirk Affoltern",1,"Aeugst am Albis","x","x",270,"Asyl/Bezirk","×"]
["17318 : Altikon (Sozialdienst Asyl, Winterthur)",17318,"Sozialdienst Asyl, Winterthur",211,"Altikon","x","x",255,"Asyl/Bezirk",""]
["17318 : Andelfingen (Sozialdienst Asyl, Winterthur)",17318,"Sozialdienst Asyl, Winterthur",30,"Andelfingen","x","x",242,"Asyl/Bezirk",""]
["17318 : Benken (ZH) (Sozialdienst Asyl, Winterthur)",17318,"Sozialdienst Asyl, Winterthur",22,"Benken (ZH)","x","x",234,"Asyl/Bezirk",""]
["17318 : Berg am Irchel (Sozialdienst Asyl, Winterthur)",17318,"Sozialdienst Asyl, Winterthur",23,"Berg am Irchel","x","x",235,"Asyl/Bezirk",""]
["14007 : Bonstetten (Sozialdienst Bezirk Affoltern)",14007,"Sozialdienst Bezirk Affoltern",3,"Bonstetten","x","x",271,"Asyl/Bezirk","×"]
["17318 : Brütten (Sozialdienst Asyl, Winterthur)",17318,"Sozialdienst Asyl, Winterthur",213,"Brütten","x","x",256,"Asyl/Bezirk",""]
["13016 : Flüchtlings- und Asylkoordination Bülach",13016,"Flüchtlings- und Asylkoordination Bülach",53,"Bülach","x","x",53,"Asyl/Bezirk",""]
["17318 : Dachsen (Sozialdienst Asyl, Winterthur)",17318,"Sozialdienst Asyl, Winterthur",25,"Dachsen","x","x",237,"Asyl/Bezirk",""]
["17318 : Dägerlen (Sozialdienst Asyl, Winterthur)",17318,"Sozialdienst Asyl, Winterthur",214,"Dägerlen","x","x",257,"Asyl/Bezirk",""]
["17318 : Dinhard (Sozialdienst Asyl, Winterthur)",17318,"Sozialdienst Asyl, Winterthur",216,"Dinhard","x","x",259,"Asyl/Bezirk",""]
["17318 : Dorf (Sozialdienst Asyl, Winterthur)",17318,"Sozialdienst Asyl, Winterthur",26,"Dorf","x","x",238,"Asyl/Bezirk",""]
["17318 : Elgg (Sozialdienst Asyl, Winterthur)",17318,"Sozialdienst Asyl, Winterthur",294,"Elgg","x","x",268,"Asyl/Bezirk",""]
["17318 : Elsau (Sozialdienst Asyl, Winterthur)",17318,"Sozialdienst Asyl, Winterthur",219,"Elsau","x","x",260,"Asyl/Bezirk",""]
["17318 : Feuerthalen (Sozialdienst Asyl, Winterthur)",17318,"Sozialdienst Asyl, Winterthur",27,"Feuerthalen","x","x",239,"Asyl/Bezirk",""]
["17318 : Flaach (Sozialdienst Asyl, Winterthur)",17318,"Sozialdienst Asyl, Winterthur",28,"Flaach","x","x",240,"Asyl/Bezirk",""]
["17318 : Flurlingen (Sozialdienst Asyl, Winterthur)",17318,"Sozialdienst Asyl, Winterthur",29,"Flurlingen","x","x",241,"Asyl/Bezirk",""]
["17318 : Hagenbuch (Sozialdienst Asyl, Winterthur)",17318,"Sozialdienst Asyl, Winterthur",220,"Hagenbuch","x","x",261,"Asyl/Bezirk",""]
["14007 : Hausen am Albis (Sozialdienst Bezirk Affoltern)",14007,"Sozialdienst Bezirk Affoltern",4,"Hausen am Albis","x","x",272,"Asyl/Bezirk","×"]
["14007 : Hedingen (Sozialdienst Bezirk Affoltern)",14007,"Sozialdienst Bezirk Affoltern",5,"Hedingen","x","x",273,"Asyl/Bezirk","×"]
["17318 : Henggart (Sozialdienst Asyl, Winterthur)",17318,"Sozialdienst Asyl, Winterthur",31,"Henggart","x","x",243,"Asyl/Bezirk",""]
["17318 : Hettlingen (Sozialdienst Asyl, Winterthur)",17318,"Sozialdienst Asyl, Winterthur",221,"Hettlingen","x","x",262,"Asyl/Bezirk",""]
["17347 : Flüchtlings- und Asylkoordination Bülach - Fälle Hochfelden",17347,"Flüchtlings- und Asylkoordination Bülach - Fälle Hochfelden",59,"Hochfelden","x",null,54,"Asyl/Bezirk",""]
["17318 : Humlikon (Sozialdienst Asyl, Winterthur)",17318,"Sozialdienst Asyl, Winterthur",32,"Humlikon","x","x",244,"Asyl/Bezirk",""]
["17318 : Kleinandelfingen (Sozialdienst Asyl, Winterthur)",17318,"Sozialdienst Asyl, Winterthur",33,"Kleinandelfingen","x","x",245,"Asyl/Bezirk",""]
["14007 : Knonau (Sozialdienst Bezirk Affoltern)",14007,"Sozialdienst Bezirk Affoltern",7,"Knonau","x","x",274,"Asyl/Bezirk","×"]
["17318 : Laufen-Uhwiesen (Sozialdienst Asyl, Winterthur)",17318,"Sozialdienst Asyl, Winterthur",34,"Laufen-Uhwiesen","x","x",246,"Asyl/Bezirk",""]
["17318 : Marthalen (Sozialdienst Asyl, Winterthur)",17318,"Sozialdienst Asyl, Winterthur",35,"Marthalen","x","x",247,"Asyl/Bezirk",""]
["14007 : Maschwanden (Sozialdienst Bezirk Affoltern)",14007,"Sozialdienst Bezirk Affoltern",8,"Maschwanden","x","x",275,"Asyl/Bezirk","×"]
["14007 : Mettmenstetten (Sozialdienst Bezirk Affoltern)",14007,"Sozialdienst Bezirk Affoltern",9,"Mettmenstetten","x","x",276,"Asyl/Bezirk","×"]
["14007 : Obfelden (Sozialdienst Bezirk Affoltern)",14007,"Sozialdienst Bezirk Affoltern",10,"Obfelden","x","x",277,"Asyl/Bezirk","×"]
["17318 : Ossingen (Sozialdienst Asyl, Winterthur)",17318,"Sozialdienst Asyl, Winterthur",37,"Ossingen","x","x",248,"Asyl/Bezirk",""]
["14007 : Ottenbach (Sozialdienst Bezirk Affoltern)",14007,"Sozialdienst Bezirk Affoltern",11,"Ottenbach","x","x",278,"Asyl/Bezirk","×"]
["17318 : Pfungen (Sozialdienst Asyl, Winterthur)",17318,"Sozialdienst Asyl, Winterthur",224,"Pfungen","x","x",263,"Asyl/Bezirk",""]
["17318 : Rheinau (Sozialdienst Asyl, Winterthur)",17318,"Sozialdienst Asyl, Winterthur",38,"Rheinau","x","x",249,"Asyl/Bezirk",""]
["17318 : Rickenbach (ZH) (Sozialdienst Asyl, Winterthur)",17318,"Sozialdienst Asyl, Winterthur",225,"Rickenbach (ZH)","x","x",264,"Asyl/Bezirk",""]
["17318 : Schlatt (ZH) (Sozialdienst Asyl, Winterthur)",17318,"Sozialdienst Asyl, Winterthur",226,"Schlatt (ZH)","x","x",265,"Asyl/Bezirk",""]
["14007 : Stallikon (Sozialdienst Bezirk Affoltern)",14007,"Sozialdienst Bezirk Affoltern",13,"Stallikon","x","x",279,"Asyl/Bezirk","×"]
["17318 : Stammheim (Sozialdienst Asyl, Winterthur)",17318,"Sozialdienst Asyl, Winterthur",292,"Stammheim","x","x",267,"Asyl/Bezirk",""]
["17318 : Thalheim an der Thur (Sozialdienst Asyl, Winterthur)",17318,"Sozialdienst Asyl, Winterthur",39,"Thalheim an der Thur","x","x",250,"Asyl/Bezirk",""]
["17318 : Trüllikon (Sozialdienst Asyl, Winterthur)",17318,"Sozialdienst Asyl, Winterthur",40,"Trüllikon","x","x",251,"Asyl/Bezirk",""]
["17318 : Truttikon (Sozialdienst Asyl, Winterthur)",17318,"Sozialdienst Asyl, Winterthur",41,"Truttikon","x","x",252,"Asyl/Bezirk",""]
["17318 : Volken (Sozialdienst Asyl, Winterthur)",17318,"Sozialdienst Asyl, Winterthur",43,"Volken","x","x",253,"Asyl/Bezirk",""]
["17318 : Wasterkingen (Sozialdienst Asyl, Winterthur)",17318,"Sozialdienst Asyl, Winterthur",70,"Wasterkingen","x","x",254,"Asyl/Bezirk",""]
["14007 : Wettswil am Albis (Sozialdienst Bezirk Affoltern)",14007,"Sozialdienst Bezirk Affoltern",14,"Wettswil am Albis","x","x",280,"Asyl/Bezirk","×"]
["17318 : Wiesendangen (Sozialdienst Asyl, Winterthur)",17318,"Sozialdienst Asyl, Winterthur",298,"Wiesendangen","x","x",269,"Asyl/Bezirk",""]
["17318 : Winterthur (Sozialdienst Asyl, Winterthur)",17318,"Sozialdienst Asyl, Winterthur",230,"Winterthur","x","x",266,"Asyl/Bezirk",""]
["17318 : Buch am Irchel (Sozialdienst Asyl, Winterthur)",17318,"Sozialdienst Asyl, Winterthur",24,"Buch am Irchel","x","x",236,"Asyl/Bezirk",""]
["17318 : Dättlikon (Sozialdienst Asyl, Winterthur)",17318,"Sozialdienst Asyl, Winterthur",215,"Dättlikon","x","x",258,"Asyl/Bezirk",""]
["17326 : Bonstetten (IKA Sozialdienst Unteramt)",17326,"IKA Sozialdienst Unteramt",3,"Bonstetten",null,"x",179,"IKA","×"]
["17326 : Stallikon (IKA Sozialdienst Unteramt)",17326,"IKA Sozialdienst Unteramt",13,"Stallikon",null,"x",180,"IKA","×"]
["17326 : Wettswil am Albis (IKA Sozialdienst Unteramt)",17326,"IKA Sozialdienst Unteramt",14,"Wettswil am Albis",null,"x",181,"IKA","×"]
["15406 : Adliswil (ORS Service AG)",15406,"ORS Service AG",131,"Adliswil","x","x",208,"ORS","×"]
["15407 : ORS Service AG Durchgangszentren",15407,"ORS Service AG Durchgangszentren",131,"Adliswil","x",null,227,"ORS",""]
["15406 : Aesch (ZH) (ORS Service AG)",15406,"ORS Service AG",241,"Aesch (ZH)","x","x",220,"ORS","×"]
["15406 : Bachenbülach (ORS Service AG)",15406,"ORS Service AG",51,"Bachenbülach","x","x",182,"ORS","×"]
["15406 : Bachs (ORS Service AG)",15406,"ORS Service AG",81,"Bachs","x","x",191,"ORS","×"]
["15406 : Bauma (ORS Service AG)",15406,"ORS Service AG",297,"Bauma","x","x",224,"ORS","×"]
["15406 : Birmensdorf (ZH) (ORS Service AG)",15406,"ORS Service AG",242,"Birmensdorf (ZH)","x","x",221,"ORS","×"]
["15406 : Boppelsen (ORS Service AG)",15406,"ORS Service AG",82,"Boppelsen","x","x",192,"ORS","×"]
["15406 : Buchs (ZH) (ORS Service AG)",15406,"ORS Service AG",83,"Buchs (ZH)","x","x",193,"ORS","×"]
["15406 : Bülach (ORS Service AG)",15406,"ORS Service AG",53,"Bülach","x","x",183,"ORS","×"]
["15406 : Dällikon (ORS Service AG)",15406,"ORS Service AG",84,"Dällikon","x","x",194,"ORS","×"]
["15406 : Dänikon (ORS Service AG)",15406,"ORS Service AG",85,"Dänikon","x","x",195,"ORS","×"]
["15406 : Dielsdorf (ORS Service AG)",15406,"ORS Service AG",86,"Dielsdorf","x","x",196,"ORS","×"]
["15406 : Dietikon (ORS Service AG)",15406,"ORS Service AG",243,"Dietikon","x","x",222,"ORS","×"]
["15406 : Dübendorf (ORS Service AG)",15406,"ORS Service AG",191,"Dübendorf","x","x",211,"ORS","×"]
["15406 : Egg (ORS Service AG)",15406,"ORS Service AG",192,"Egg","x","x",212,"ORS","×"]
["15407 : Egg (ORS Service AG Durchgangszentren)",15407,"ORS Service AG Durchgangszentren",192,"Egg","x",null,229,"ORS",""]
["15406 : Ellikon an der Thur (ORS Service AG)",15406,"ORS Service AG",218,"Ellikon an der Thur","x","x",215,"ORS","×"]
["15406 : Elsau (ORS Service AG)",15406,"ORS Service AG",219,"Elsau","x","x",216,"ORS","×"]
["15406 : Embrach (ORS Service AG)",15406,"ORS Service AG",56,"Embrach","x","x",184,"ORS","×"]
["15407 : Embrach (ORS Service AG Durchgangszentren)",15407,"ORS Service AG Durchgangszentren",56,"Embrach","x",null,226,"ORS",""]
["15406 : Freienstein-Teufen (ORS Service AG)",15406,"ORS Service AG",57,"Freienstein-Teufen","x","x",185,"ORS","×"]
["15406 : Grüningen (ORS Service AG)",15406,"ORS Service AG",116,"Grüningen","x","x",207,"ORS","×"]
["15406 : Hüttikon (ORS Service AG)",15406,"ORS Service AG",87,"Hüttikon","x","x",197,"ORS","×"]
["15406 : Kloten (ORS Service AG)",15406,"ORS Service AG",62,"Kloten","x","x",186,"ORS","×"]
["15406 : Lindau (ORS Service AG)",15406,"ORS Service AG",176,"Lindau","x","x",210,"ORS","×"]
["15407 : Lindau (ORS Service AG Durchgangszentren)",15407,"ORS Service AG Durchgangszentren",176,"Lindau","x",null,228,"ORS",""]
["15406 : Meilen (ORS Service AG)",15406,"ORS Service AG",156,"Meilen","x","x",209,"ORS","×"]
["15406 : Mönchaltorf (ORS Service AG)",15406,"ORS Service AG",196,"Mönchaltorf","x","x",213,"ORS","×"]
["15406 : Neerach (ORS Service AG)",15406,"ORS Service AG",88,"Neerach","x","x",198,"ORS","×"]
["15406 : Niederglatt (ORS Service AG)",15406,"ORS Service AG",89,"Niederglatt","x","x",199,"ORS","×"]
["15406 : Niederhasli (ORS Service AG)",15406,"ORS Service AG",90,"Niederhasli","x","x",200,"ORS","×"]
["15406 : Oberembrach (ORS Service AG)",15406,"ORS Service AG",65,"Oberembrach","x","x",187,"ORS","×"]
["15406 : Oberglatt (ORS Service AG)",15406,"ORS Service AG",92,"Oberglatt","x","x",201,"ORS","×"]
["15406 : Oberweningen (ORS Service AG)",15406,"ORS Service AG",93,"Oberweningen","x","x",202,"ORS","×"]
["15406 : Otelfingen (ORS Service AG)",15406,"ORS Service AG",94,"Otelfingen","x","x",203,"ORS","×"]
["15406 : Rorbas (ORS Service AG)",15406,"ORS Service AG",68,"Rorbas","x","x",188,"ORS","×"]
["15406 : Rümlang (ORS Service AG)",15406,"ORS Service AG",97,"Rümlang","x","x",204,"ORS","×"]
["15406 : Seuzach (ORS Service AG)",15406,"ORS Service AG",227,"Seuzach","x","x",217,"ORS","×"]
["15406 : Stadel (ORS Service AG)",15406,"ORS Service AG",100,"Stadel","x","x",205,"ORS","×"]
["15406 : Volketswil (ORS Service AG)",15406,"ORS Service AG",199,"Volketswil","x","x",214,"ORS","×"]
["15406 : Wallisellen (ORS Service AG)",15406,"ORS Service AG",69,"Wallisellen","x","x",189,"ORS","×"]
["15406 : Weiach (ORS Service AG)",15406,"ORS Service AG",102,"Weiach","x","x",206,"ORS","×"]
["15406 : Wiesendangen (ORS Service AG)",15406,"ORS Service AG",298,"Wiesendangen","x","x",225,"ORS","×"]
["15406 : Winkel (ORS Service AG)",15406,"ORS Service AG",72,"Winkel","x","x",190,"ORS","×"]
["15406 : Winterthur (ORS Service AG)",15406,"ORS Service AG",230,"Winterthur","x","x",218,"ORS","×"]
["15406 : Zell (ZH) (ORS Service AG)",15406,"ORS Service AG",231,"Zell (ZH)","x","x",219,"ORS","×"]
["15406 : Zürich (ORS Service AG)",15406,"ORS Service AG",261,"Zürich","x","x",223,"ORS","×"]