{"text_format":"1","workbook":"xlsx","n_sheets":8,"sheets":["Startseite","Dateneingabe","Anleitung Makros","Aktualisierung","Optionen","Angebote","Gemeinden","SLT-Leistungsklasse"],"not_rendered":{"charts":0,"images":7,"macros":1,"external_links":0,"defined_names":29,"comments":4,"pivot_tables":0},"unopened":[],"bounds":{"document_bytes":16777216,"sheet_cells":100000,"rows_first":2000,"rows_last":500,"rows_between":2000,"halvings":0,"cell_chars":16384,"cell_head_chars":4096},"cells_cut":0,"cells_raw":0,"read":"whole","date_system":"1900"}

{"sheet":"Startseite","index":0,"n_rows":52,"n_cols":9,"rows_kept":52,"cut":false,"hidden":false,"merged":[[3,1,3,2]]}
[]
[]
[null,"Erhebungsvorlage Integrationsagenda Kanton Zürich (IAZH)"]
[null,"Version 36 vom 9. Januar 2023",null,null,{"$f":"\"Version 2022 mit dem Arbeitsblatt «Aktualisierung» (Version \" & VALUE(SUBSTITUTE(INDEX(file_version_list,2),\"V\",\"\")) & \" vom \" & TEXT(INDEX(file_version_timestamps,2),\"t. MMMM JJJJ\") & \")\"","v":"Version 2022 mit dem Arbeitsblatt «Aktualisierung» (Version 36 vom 9. Januar 2023)"}]
[]
[]
[null,"Kontrolle des Kostendaches",null,null,{"$f":"IF(MONTH(TODAY())<4,YEAR(TODAY()-1),IF(MAX(Dateneingabe!$Q:$Q)=0,\"\",YEAR(MAX(Dateneingabe!$Q:$Q))))","v":2023}]
[null,{"$f":"IF(Auswertung_letztes_Jahr<2019,\"\",Auswertung_letztes_Jahr)","v":2023},"Auswertungsjahr",null,{"$f":"IFERROR(\">=\"&TEXT(DATE($B$8,1,1),\"T.M.JJJJ\"),\"\")","v":">=1.1.2023"},{"$f":"IFERROR(\"<=\"&TEXT(DATE($B$8,12,31),\"T.M.JJJJ\"),\"\")","v":"<=31.12.2023"}]
{"$rows_left_out":45}
{"sheet":"Dateneingabe","index":1,"n_rows":51,"n_cols":59,"rows_kept":51,"cut":false,"hidden":false,"merged":[]}
["AHV-Nummer","Nachname","Vorname","Geschlecht","Geschlecht_Code","Geburtsdatum","Aufenthaltsstatus","Aufenthaltsstatus_Code","Staatsangehörigkeit","Staatsangehörigkeit_Code","Einreisedatum_in_CH","Zuzugsdatum_in_Kanton","Dossiernummer","Angebot","Angebotsnummer","Angebotstitel","Eintrittsdatum","Austrittsdatum","Angebot_CHF","TR1_Datum","TR1_Betrag","TR2_Datum","TR2_Betrag","TR3_Datum","TR3_Betrag","TR4_Datum","TR4_Betrag","TR5_Datum","TR5_Betrag","TR6_Datum","TR6_Betrag","TR7_Datum","TR7_Betrag","TR8_Datum","TR8_Betrag","TR9_Datum","TR9_Betrag","TR10_Datum","TR10_Betrag","TR11_Datum","TR11_Betrag","TR12_Datum","TR12_Betrag","Abgeschlossen","Kosten_CHF","Februar_Kosten_CHF","Rückzahlung_CHF","Diff-ID","Bemerkungen_intern","Ausblenden","dirty","SLT-ID","Politische_Gemeinde","Politische_Gemeinde_Code","Abrechnung_Gemeinde_Jahr","Abrechnung_Gemeinde_Jahr_Flü","SLT_ID","Name_Bezirk","row_id"]
[null,null,null,null,{"$f":"IFERROR(INDEX(OFFSET(Liste_Geschlecht,0,-1),MATCH($D2,Liste_Geschlecht,0)),\"\")","v":""},null,null,{"$f":"IFERROR(INDEX(OFFSET(Liste_Aufenthaltsstatus,0,-1),MATCH($G2,Liste_Aufenthaltsstatus,0)),\"\")","v":""},null,{"$f":"IFERROR(INDEX(OFFSET(Staaten,0,-1),MATCH($I2,Staaten,0)),\"\")","v":""},null,null,null,null,{"$f":"IFERROR(LEFT(N2,FIND(\" \",$N2)-1),\"\")","v":""},{"$f":"IFERROR(INDEX(Angebote!$J:$J,MATCH($O2,OFFSET(Liste_Angebote,0,1),0)+ROW(Liste_Angebote)-1),\"\")","v":""},null,null,null,null,null,null,null,null,null,null,null,null,null,null,null,null,null,null,null,null,null,null,null,null,null,null,null,null,{"$f":"IF(AND(ISBLANK($AR2),ISNUMBER($S2)),$S2,IF(SUM($U2,$W2,$Y2,$AA2,$AC2,$AE2,$AG2,$AI2,$AK2,$AM2,$AO2,$AQ2)<>0,SUM($U2,$W2,$Y2,$AA2,$AC2,$AE2,$AG2,$AI2,$AK2,$AM2,$AO2,$AQ2),$S2))","v":0},null,{"$f":"IF(ISNUMBER(AT2),AT2-AS2,0)","v":0},{"$f":"IF(AND($AU2<>0,COUNTIF($AU$2:$AU2,\"<>0\")<>OFFSET(AV2,-1,0)),COUNTIF($AU$2:$AU2,\"<>0\"),\"\")","v":""},{"$f":"IF(AND(_xlfn.ISFORMULA($AS2),ISBLANK($AR2),NOT(ISBLANK($S2))),\"Noch nicht abgerechnet; Kosten gemäss Offerte\",\"\")","v":""},{"$f":"IFERROR(IF($Q2=\"\",\"\",IF(AND(YEAR($Q2)+IF(MONTH(TODAY())<4,1,0)<YEAR(TODAY()),$AR2<>\"\"),YEAR($Q2),IF(AND(YEAR($Q2)<YEAR(TODAY()),R2<TODAY()-183),YEAR($Q2),\"\"))),\"\")","v":""},{"$f":"IFERROR(IF(_xlfn.CONCAT($A2:$AR2,TEXT($AS2,\"0;-0;;@\"),$AT2,TEXT($AU2,\"0;-0;;@\"),$AW2)=\"\",IF(AND(ROW(AY2)>2,OFFSET(AY2,1,0)<>\"\"),\"^\",\"\"),\"×\"),\"\")","v":""},{"$f":"IF($A2&$B2=\"\",\"\",OFFSET(AZ2,-1,0))","v":""},{"$f":"IFERROR(VLOOKUP($AZ2,'SLT-Leistungsklasse'!$A:$H,5,FALSE),IF($A2 & $B2 & $C2=\"\",\"\",OFFSET(BA2,-1,0)))","v":""},{"$f":"IFERROR(INDEX(OFFSET(ZH,0,-1),MATCH($BA2,ZH,0)),\"\")","v":""},{"$f":"IFERROR(IF(OR($BB2=\"\",$Q2 < _xludf.Date(2000,1,1)),\"\",$BB2 & \"·\" & YEAR($Q2)),\"\")","v":""},{"$f":"IF(OR($H2=0,$H2=3,$H2=4),$BC2,\"\")","v":""},{"$f":"IFERROR(VLOOKUP($AZ2,'SLT-Leistungsklasse'!A:B,2,FALSE),\"\")","v":""},{"$f":"IFERROR(IF(AND($BA2<>\"\",$AZ2<>\"\"),IFERROR(INDEX(OFFSET(ZH,0,-2),MATCH($BA2,ZH,0)),\"\"),\"\"),\"\")","v":""}]
[null,null,null,null,{"$f":"IFERROR(INDEX(OFFSET(Liste_Geschlecht,0,-1),MATCH($D3,Liste_Geschlecht,0)),\"\")","v":""},null,null,{"$f":"IFERROR(INDEX(OFFSET(Liste_Aufenthaltsstatus,0,-1),MATCH($G3,Liste_Aufenthaltsstatus,0)),\"\")","v":""},null,{"$f":"IFERROR(INDEX(OFFSET(Staaten,0,-1),MATCH($I3,Staaten,0)),\"\")","v":""},null,null,null,null,{"$f":"IFERROR(LEFT(N3,FIND(\" \",$N3)-1),\"\")","v":""},{"$f":"IFERROR(INDEX(Angebote!$J:$J,MATCH($O3,OFFSET(Liste_Angebote,0,1),0)+ROW(Liste_Angebote)-1),\"\")","v":""},null,null,null,null,null,null,null,null,null,null,null,null,null,null,null,null,null,null,null,null,null,null,null,null,null,null,null,null,{"$f":"IF(AND(ISBLANK($AR3),ISNUMBER($S3)),$S3,IF(SUM($U3,$W3,$Y3,$AA3,$AC3,$AE3,$AG3,$AI3,$AK3,$AM3,$AO3,$AQ3)<>0,SUM($U3,$W3,$Y3,$AA3,$AC3,$AE3,$AG3,$AI3,$AK3,$AM3,$AO3,$AQ3),$S3))","v":0},null,{"$f":"IF(ISNUMBER(AT3),AT3-AS3,0)","v":0},{"$f":"IF(AND($AU3<>0,COUNTIF($AU$2:$AU3,\"<>0\")<>OFFSET(AV3,-1,0)),COUNTIF($AU$2:$AU3,\"<>0\"),\"\")","v":""},{"$f":"IF(AND(_xlfn.ISFORMULA($AS3),ISBLANK($AR3),NOT(ISBLANK($S3))),\"Noch nicht abgerechnet; Kosten gemäss Offerte\",\"\")","v":""},{"$f":"IFERROR(IF($Q3=\"\",\"\",IF(AND(YEAR($Q3)+IF(MONTH(TODAY())<4,1,0)<YEAR(TODAY()),$AR3<>\"\"),YEAR($Q3),IF(AND(YEAR($Q3)<YEAR(TODAY()),R3<TODAY()-183),YEAR($Q3),\"\"))),\"\")","v":""},{"$f":"IFERROR(IF(_xlfn.CONCAT($A3:$AR3,TEXT($AS3,\"0;-0;;@\"),$AT3,TEXT($AU3,\"0;-0;;@\"),$AW3)=\"\",IF(AND(ROW(AY3)>2,OFFSET(AY3,1,0)<>\"\"),\"^\",\"\"),\"×\"),\"\")","v":""},{"$f":"IF($A3&$B3=\"\",\"\",OFFSET(AZ3,-1,0))","v":""},{"$f":"IFERROR(VLOOKUP($AZ3,'SLT-Leistungsklasse'!$A:$H,5,FALSE),IF($A3 & $B3 & $C3=\"\",\"\",OFFSET(BA3,-1,0)))","v":""},{"$f":"IFERROR(INDEX(OFFSET(ZH,0,-1),MATCH($BA3,ZH,0)),\"\")","v":""},{"$f":"IFERROR(IF(OR($BB3=\"\",$Q3 < DATE(2000,1,1)),\"\",$BB3 & \"·\" & YEAR($Q3)),\"\")","v":""},{"$f":"IF(OR($H3=0,$H3=3,$H3=4),$BC3,\"\")","v":""},{"$f":"IFERROR(VLOOKUP($AZ3,'SLT-Leistungsklasse'!A:B,2,FALSE),\"\")","v":""},{"$f":"IFERROR(IF(AND($BA3<>\"\",$AZ3<>\"\"),IFERROR(INDEX(OFFSET(ZH,0,-2),MATCH($BA3,ZH,0)),\"\"),\"\"),\"\")","v":""},"puvs-pfu"]
[null,null,null,null,{"$f":"IFERROR(INDEX(OFFSET(Liste_Geschlecht,0,-1),MATCH($D4,Liste_Geschlecht,0)),\"\")","v":""},null,null,{"$f":"IFERROR(INDEX(OFFSET(Liste_Aufenthaltsstatus,0,-1),MATCH($G4,Liste_Aufenthaltsstatus,0)),\"\")","v":""},null,{"$f":"IFERROR(INDEX(OFFSET(Staaten,0,-1),MATCH($I4,Staaten,0)),\"\")","v":""},null,null,null,null,{"$f":"IFERROR(LEFT(N4,FIND(\" \",$N4)-1),\"\")","v":""},{"$f":"IFERROR(INDEX(Angebote!$J:$J,MATCH($O4,OFFSET(Liste_Angebote,0,1),0)+ROW(Liste_Angebote)-1),\"\")","v":""},null,null,null,null,null,null,null,null,null,null,null,null,null,null,null,null,null,null,null,null,null,null,null,null,null,null,null,null,0,null,0,{"$f":"IF(AND($AU4<>0,COUNTIF($AU$2:$AU4,\"<>0\")<>OFFSET(AV4,-1,0)),COUNTIF($AU$2:$AU4,\"<>0\"),\"\")","v":""},{"$f":"IF(AND(_xlfn.ISFORMULA($AS4),ISBLANK($AR4),NOT(ISBLANK($S4))),\"Noch nicht abgerechnet; Kosten gemäss Offerte\",\"\")","v":""},{"$f":"IFERROR(IF($Q4=\"\",\"\",IF(AND(YEAR($Q4)+IF(MONTH(TODAY())<4,1,0)<YEAR(TODAY()),$AR4<>\"\"),YEAR($Q4),IF(AND(YEAR($Q4)<YEAR(TODAY()),R4<TODAY()-183),YEAR($Q4),\"\"))),\"\")","v":""},{"$f":"IFERROR(IF(_xlfn.CONCAT($A4:$AR4,TEXT($AS4,\"0;-0;;@\"),$AT4,TEXT($AU4,\"0;-0;;@\"),$AW4)=\"\",IF(AND(ROW(AY4)>2,OFFSET(AY4,1,0)<>\"\"),\"^\",\"\"),\"×\"),\"\")","v":""},{"$f":"IF($A4&$B4=\"\",\"\",OFFSET(AZ4,-1,0))","v":""},{"$f":"IFERROR(VLOOKUP($AZ4,'SLT-Leistungsklasse'!$A:$H,5,FALSE),IF($A4 & $B4 & $C4=\"\",\"\",OFFSET(BA4,-1,0)))","v":""},{"$f":"IFERROR(INDEX(OFFSET(ZH,0,-1),MATCH($BA4,ZH,0)),\"\")","v":""},{"$f":"IFERROR(IF(OR($BB4=\"\",$Q4 < DATE(2000,1,1)),\"\",$BB4 & \"·\" & YEAR($Q4)),\"\")","v":""},{"$f":"IF(OR($H4=0,$H4=3,$H4=4),$BC4,\"\")","v":""},{"$f":"IFERROR(VLOOKUP($AZ4,'SLT-Leistungsklasse'!A:B,2,FALSE),\"\")","v":""},{"$f":"IFERROR(IF(AND($BA4<>\"\",$AZ4<>\"\"),IFERROR(INDEX(OFFSET(ZH,0,-2),MATCH($BA4,ZH,0)),\"\"),\"\"),\"\")","v":""},"czxt-p17"]
[null,null,null,null,{"$f":"IFERROR(INDEX(OFFSET(Liste_Geschlecht,0,-1),MATCH($D5,Liste_Geschlecht,0)),\"\")","v":""},null,null,{"$f":"IFERROR(INDEX(OFFSET(Liste_Aufenthaltsstatus,0,-1),MATCH($G5,Liste_Aufenthaltsstatus,0)),\"\")","v":""},null,{"$f":"IFERROR(INDEX(OFFSET(Staaten,0,-1),MATCH($I5,Staaten,0)),\"\")","v":""},null,null,null,null,{"$f":"IFERROR(LEFT(N5,FIND(\" \",$N5)-1),\"\")","v":""},{"$f":"IFERROR(INDEX(Angebote!$J:$J,MATCH($O5,OFFSET(Liste_Angebote,0,1),0)+ROW(Liste_Angebote)-1),\"\")","v":""},null,null,null,null,null,null,null,null,null,null,null,null,null,null,null,null,null,null,null,null,null,null,null,null,null,null,null,null,0,null,0,{"$f":"IF(AND($AU5<>0,COUNTIF($AU$2:$AU5,\"<>0\")<>OFFSET(AV5,-1,0)),COUNTIF($AU$2:$AU5,\"<>0\"),\"\")","v":""},{"$f":"IF(AND(_xlfn.ISFORMULA($AS5),ISBLANK($AR5),NOT(ISBLANK($S5))),\"Noch nicht abgerechnet; Kosten gemäss Offerte\",\"\")","v":""},{"$f":"IFERROR(IF($Q5=\"\",\"\",IF(AND(YEAR($Q5)+IF(MONTH(TODAY())<4,1,0)<YEAR(TODAY()),$AR5<>\"\"),YEAR($Q5),IF(AND(YEAR($Q5)<YEAR(TODAY()),R5<TODAY()-183),YEAR($Q5),\"\"))),\"\")","v":""},{"$f":"IFERROR(IF(_xlfn.CONCAT($A5:$AR5,TEXT($AS5,\"0;-0;;@\"),$AT5,TEXT($AU5,\"0;-0;;@\"),$AW5)=\"\",IF(AND(ROW(AY5)>2,OFFSET(AY5,1,0)<>\"\"),\"^\",\"\"),\"×\"),\"\")","v":""},{"$f":"IF($A5&$B5=\"\",\"\",OFFSET(AZ5,-1,0))","v":""},{"$f":"IFERROR(VLOOKUP($AZ5,'SLT-Leistungsklasse'!$A:$H,5,FALSE),IF($A5 & $B5 & $C5=\"\",\"\",OFFSET(BA5,-1,0)))","v":""},{"$f":"IFERROR(INDEX(OFFSET(ZH,0,-1),MATCH($BA5,ZH,0)),\"\")","v":""},{"$f":"IFERROR(IF(OR($BB5=\"\",$Q5 < DATE(2000,1,1)),\"\",$BB5 & \"·\" & YEAR($Q5)),\"\")","v":""},{"$f":"IF(OR($H5=0,$H5=3,$H5=4),$BC5,\"\")","v":""},{"$f":"IFERROR(VLOOKUP($AZ5,'SLT-Leistungsklasse'!A:B,2,FALSE),\"\")","v":""},{"$f":"IFERROR(IF(AND($BA5<>\"\",$AZ5<>\"\"),IFERROR(INDEX(OFFSET(ZH,0,-2),MATCH($BA5,ZH,0)),\"\"),\"\"),\"\")","v":""},"hhje-a8z"]
[null,null,null,null,{"$f":"IFERROR(INDEX(OFFSET(Liste_Geschlecht,0,-1),MATCH($D6,Liste_Geschlecht,0)),\"\")","v":""},null,null,{"$f":"IFERROR(INDEX(OFFSET(Liste_Aufenthaltsstatus,0,-1),MATCH($G6,Liste_Aufenthaltsstatus,0)),\"\")","v":""},null,{"$f":"IFERROR(INDEX(OFFSET(Staaten,0,-1),MATCH($I6,Staaten,0)),\"\")","v":""},null,null,null,null,{"$f":"IFERROR(LEFT(N6,FIND(\" \",$N6)-1),\"\")","v":""},{"$f":"IFERROR(INDEX(Angebote!$J:$J,MATCH($O6,OFFSET(Liste_Angebote,0,1),0)+ROW(Liste_Angebote)-1),\"\")","v":""},null,null,null,null,null,null,null,null,null,null,null,null,null,null,null,null,null,null,null,null,null,null,null,null,null,null,null,null,0,null,0,{"$f":"IF(AND($AU6<>0,COUNTIF($AU$2:$AU6,\"<>0\")<>OFFSET(AV6,-1,0)),COUNTIF($AU$2:$AU6,\"<>0\"),\"\")","v":""},{"$f":"IF(AND(_xlfn.ISFORMULA($AS6),ISBLANK($AR6),NOT(ISBLANK($S6))),\"Noch nicht abgerechnet; Kosten gemäss Offerte\",\"\")","v":""},{"$f":"IFERROR(IF($Q6=\"\",\"\",IF(AND(YEAR($Q6)+IF(MONTH(TODAY())<4,1,0)<YEAR(TODAY()),$AR6<>\"\"),YEAR($Q6),IF(AND(YEAR($Q6)<YEAR(TODAY()),R6<TODAY()-183),YEAR($Q6),\"\"))),\"\")","v":""},{"$f":"IFERROR(IF(_xlfn.CONCAT($A6:$AR6,TEXT($AS6,\"0;-0;;@\"),$AT6,TEXT($AU6,\"0;-0;;@\"),$AW6)=\"\",IF(AND(ROW(AY6)>2,OFFSET(AY6,1,0)<>\"\"),\"^\",\"\"),\"×\"),\"\")","v":""},{"$f":"IF($A6&$B6=\"\",\"\",OFFSET(AZ6,-1,0))","v":""},{"$f":"IFERROR(VLOOKUP($AZ6,'SLT-Leistungsklasse'!$A:$H,5,FALSE),IF($A6 & $B6 & $C6=\"\",\"\",OFFSET(BA6,-1,0)))","v":""},{"$f":"IFERROR(INDEX(OFFSET(ZH,0,-1),MATCH($BA6,ZH,0)),\"\")","v":""},{"$f":"IFERROR(IF(OR($BB6=\"\",$Q6 < DATE(2000,1,1)),\"\",$BB6 & \"·\" & YEAR($Q6)),\"\")","v":""},{"$f":"IF(OR($H6=0,$H6=3,$H6=4),$BC6,\"\")","v":""},{"$f":"IFERROR(VLOOKUP($AZ6,'SLT-Leistungsklasse'!A:B,2,FALSE),\"\")","v":""},{"$f":"IFERROR(IF(AND($BA6<>\"\",$AZ6<>\"\"),IFERROR(INDEX(OFFSET(ZH,0,-2),MATCH($BA6,ZH,0)),\"\"),\"\"),\"\")","v":""},"a0fg-0vj"]
[null,null,null,null,{"$f":"IFERROR(INDEX(OFFSET(Liste_Geschlecht,0,-1),MATCH($D7,Liste_Geschlecht,0)),\"\")","v":""},null,null,{"$f":"IFERROR(INDEX(OFFSET(Liste_Aufenthaltsstatus,0,-1),MATCH($G7,Liste_Aufenthaltsstatus,0)),\"\")","v":""},null,{"$f":"IFERROR(INDEX(OFFSET(Staaten,0,-1),MATCH($I7,Staaten,0)),\"\")","v":""},null,null,null,null,{"$f":"IFERROR(LEFT(N7,FIND(\" \",$N7)-1),\"\")","v":""},{"$f":"IFERROR(INDEX(Angebote!$J:$J,MATCH($O7,OFFSET(Liste_Angebote,0,1),0)+ROW(Liste_Angebote)-1),\"\")","v":""},null,null,null,null,null,null,null,null,null,null,null,null,null,null,null,null,null,null,null,null,null,null,null,null,null,null,null,null,0,null,0,{"$f":"IF(AND($AU7<>0,COUNTIF($AU$2:$AU7,\"<>0\")<>OFFSET(AV7,-1,0)),COUNTIF($AU$2:$AU7,\"<>0\"),\"\")","v":""},{"$f":"IF(AND(_xlfn.ISFORMULA($AS7),ISBLANK($AR7),NOT(ISBLANK($S7))),\"Noch nicht abgerechnet; Kosten gemäss Offerte\",\"\")","v":""},{"$f":"IFERROR(IF($Q7=\"\",\"\",IF(AND(YEAR($Q7)+IF(MONTH(TODAY())<4,1,0)<YEAR(TODAY()),$AR7<>\"\"),YEAR($Q7),IF(AND(YEAR($Q7)<YEAR(TODAY()),R7<TODAY()-183),YEAR($Q7),\"\"))),\"\")","v":""},{"$f":"IFERROR(IF(_xlfn.CONCAT($A7:$AR7,TEXT($AS7,\"0;-0;;@\"),$AT7,TEXT($AU7,\"0;-0;;@\"),$AW7)=\"\",IF(AND(ROW(AY7)>2,OFFSET(AY7,1,0)<>\"\"),\"^\",\"\"),\"×\"),\"\")","v":""},{"$f":"IF($A7&$B7=\"\",\"\",OFFSET(AZ7,-1,0))","v":""},{"$f":"IFERROR(VLOOKUP($AZ7,'SLT-Leistungsklasse'!$A:$H,5,FALSE),IF($A7 & $B7 & $C7=\"\",\"\",OFFSET(BA7,-1,0)))","v":""},{"$f":"IFERROR(INDEX(OFFSET(ZH,0,-1),MATCH($BA7,ZH,0)),\"\")","v":""},{"$f":"IFERROR(IF(OR($BB7=\"\",$Q7 < DATE(2000,1,1)),\"\",$BB7 & \"·\" & YEAR($Q7)),\"\")","v":""},{"$f":"IF(OR($H7=0,$H7=3,$H7=4),$BC7,\"\")","v":""},{"$f":"IFERROR(VLOOKUP($AZ7,'SLT-Leistungsklasse'!A:B,2,FALSE),\"\")","v":""},{"$f":"IFERROR(IF(AND($BA7<>\"\",$AZ7<>\"\"),IFERROR(INDEX(OFFSET(ZH,0,-2),MATCH($BA7,ZH,0)),\"\"),\"\"),\"\")","v":""},"2lj3-9pv"]
[null,null,null,null,{"$f":"IFERROR(INDEX(OFFSET(Liste_Geschlecht,0,-1),MATCH($D8,Liste_Geschlecht,0)),\"\")","v":""},null,null,{"$f":"IFERROR(INDEX(OFFSET(Liste_Aufenthaltsstatus,0,-1),MATCH($G8,Liste_Aufenthaltsstatus,0)),\"\")","v":""},null,{"$f":"IFERROR(INDEX(OFFSET(Staaten,0,-1),MATCH($I8,Staaten,0)),\"\")","v":""},null,null,null,null,{"$f":"IFERROR(LEFT(N8,FIND(\" \",$N8)-1),\"\")","v":""},{"$f":"IFERROR(INDEX(Angebote!$J:$J,MATCH($O8,OFFSET(Liste_Angebote,0,1),0)+ROW(Liste_Angebote)-1),\"\")","v":""},null,null,null,null,null,null,null,null,null,null,null,null,null,null,null,null,null,null,null,null,null,null,null,null,null,null,null,null,0,null,0,{"$f":"IF(AND($AU8<>0,COUNTIF($AU$2:$AU8,\"<>0\")<>OFFSET(AV8,-1,0)),COUNTIF($AU$2:$AU8,\"<>0\"),\"\")","v":""},{"$f":"IF(AND(_xlfn.ISFORMULA($AS8),ISBLANK($AR8),NOT(ISBLANK($S8))),\"Noch nicht abgerechnet; Kosten gemäss Offerte\",\"\")","v":""},{"$f":"IFERROR(IF($Q8=\"\",\"\",IF(AND(YEAR($Q8)+IF(MONTH(TODAY())<4,1,0)<YEAR(TODAY()),$AR8<>\"\"),YEAR($Q8),IF(AND(YEAR($Q8)<YEAR(TODAY()),R8<TODAY()-183),YEAR($Q8),\"\"))),\"\")","v":""},{"$f":"IFERROR(IF(_xlfn.CONCAT($A8:$AR8,TEXT($AS8,\"0;-0;;@\"),$AT8,TEXT($AU8,\"0;-0;;@\"),$AW8)=\"\",IF(AND(ROW(AY8)>2,OFFSET(AY8,1,0)<>\"\"),\"^\",\"\"),\"×\"),\"\")","v":""},{"$f":"IF($A8&$B8=\"\",\"\",OFFSET(AZ8,-1,0))","v":""},{"$f":"IFERROR(VLOOKUP($AZ8,'SLT-Leistungsklasse'!$A:$H,5,FALSE),IF($A8 & $B8 & $C8=\"\",\"\",OFFSET(BA8,-1,0)))","v":""},{"$f":"IFERROR(INDEX(OFFSET(ZH,0,-1),MATCH($BA8,ZH,0)),\"\")","v":""},{"$f":"IFERROR(IF(OR($BB8=\"\",$Q8 < DATE(2000,1,1)),\"\",$BB8 & \"·\" & YEAR($Q8)),\"\")","v":""},{"$f":"IF(OR($H8=0,$H8=3,$H8=4),$BC8,\"\")","v":""},{"$f":"IFERROR(VLOOKUP($AZ8,'SLT-Leistungsklasse'!A:B,2,FALSE),\"\")","v":""},{"$f":"IFERROR(IF(AND($BA8<>\"\",$AZ8<>\"\"),IFERROR(INDEX(OFFSET(ZH,0,-2),MATCH($BA8,ZH,0)),\"\"),\"\"),\"\")","v":""},"ntsg-ax1"]
{"$rows_left_out":44}
{"sheet":"Anleitung Makros","index":2,"n_rows":7,"n_cols":2,"rows_kept":7,"cut":false,"hidden":true,"merged":[[1,1,1,2],[3,1,3,3],[4,1,4,3],[6,1,6,3],[9,1,9,3]]}
[]
[null,"Makros aktivieren!"]
[]
[null,"Die «Erhebungsvorlage 2022» verwendet Makros (und hat deshalb die Dateierweiterung .xlsm). Sie müssen Makros aktivieren, um zufriedenstellend mit der Erhebungsvorlage arbeiten zu können. Wenn Sie diese Meldung sehen, so werden die Makros auf diesem Computer nicht ausgeführt. \n\nSie können Makros wie folgt aktivieren:\n"]
[null,"● Falls Sie oben im Fenster einen gelben Balken sehen mit einer weissen Taste «Bearbeitung aktivieren» oder «Inhalt aktivieren», so drücken Sie diese Taste. Sie erlauben damit die Makros für diese Datei. \n    Die Makros werden dann automatisch gestartet, und die Meldung erscheint erst wieder, wenn Sie die Datei an einem anderen Ort abspeichern. "]
[]
[null,"● Falls Sie den untenstehenden Balken sehen, so klicken Sie auf «Trust Center» und öffnen Sie dort die «Einstellungen für das Trust-Center». Wählen Sie links «Makroeinstellungen» dann die Option\n    «Deaktivieren von VBA-Makros mit Benachrichtigung». Allenfalls müssen Sie die Einstellungen im Trust Center gemeinsam mit Ihrem Informatikverantwortlichen überarbeiten."]

{"sheet":"Aktualisierung","index":3,"n_rows":14,"n_cols":5,"rows_kept":14,"cut":false,"hidden":false,"merged":[]}
[]
[null,"Verwaltungsfunktionen",{"$f":"IF(recent_fileversion_check_ts<>\"\",\"Letzte Prüfung für neue Versionen\"&CHAR(10)&\"am \"&TEXT(recent_fileversion_check_ts,OFFSET(application_language,0,1)),\"\")","v":""}]
[]
[null,"Ablageort der jederzeit aktuellen Datei: "]
[null,"https://iazh.fi-ji-zh.ch/dl/erhebungsvorlage-iazh.xlsm",null,49,{"$f":"IF(application_language=1,\"d. mmmm yyyy hh:nn:ss\",\"T. MMMM JJJJ, HH:mm:ss\")","v":"T. MMMM JJJJ, HH:mm:ss"}]
[]
[1,"Angebote aktualisieren",{"$f":"INDEX(file_version_list,2)&\" vom \"&TEXT(INDEX(file_version_timestamps,2),\"T. MMMM JJJJ\")","v":" V036 vom 9. Januar 2023"}]
[null,"Klicken Sie auf die Taste rechts, um die Liste der Angebote (und alle anderen Wertelisten) zu aktualisieren.\nDie neuen Daten werden aus dem Internet geladen. "]
{"$rows_left_out":7}
{"sheet":"Optionen","index":4,"n_rows":298,"n_cols":9,"rows_kept":298,"cut":false,"hidden":true,"merged":[]}
["Politische_Gemeinde",null,"Aufenthaltsstatus",null,"Staatsangehörigkeit",null,"Geschlecht",null,"Spaltentitel"]
[21,"Adlikon",5,"Schutzbedürftige (S)",8571,"Abchasien",1,"Männlich","SLT-ID"]
[131,"Adliswil",1,"Asylsuchende (N)",8579,"Adscharien",2,"Weiblich","Politische_Gemeinde"]
[241,"Aesch (ZH)",2,"Vorläufig Aufgenommene (F)",8501,"Afghanistan",3,"Unbestimmt","Politische_Gemeinde_Code"]
[1,"Aeugst am Albis",3,"Vorläufig aufgenommene Flüchtlinge (F)",8359,"Ägypten","","","Abrechnung_Gemeinde_Jahr"]
[2,"Affoltern am Albis",4,"Anerkannte Flüchtlinge B",8274,"Alandinseln","","","SLT_ID"]
[211,"Altikon",0,"Flüchtlinge (status unbekannt)",8201,"Albanien","","","Name_Bezirk"]
[30,"Andelfingen","","",8270,"Alderney","","","row_id"]
{"$rows_left_out":291}
{"sheet":"Angebote","index":5,"n_rows":256,"n_cols":12,"rows_kept":256,"cut":false,"hidden":true,"merged":[]}
["Dropdown-Text","Angebotsnummer","Angebotsname","Anbietende Institution","Anbietende Institution","Status","Angebot_gültig_ab ","Angebot_gültig_bis","zuletzt_mutiert_am","=TEXTVERKETTEN(\" \";WAHR;C2;WENN(ISTLEER(D2);\"\";\"(\"&WECHSELN(D2;\"---\n- \";\"\")&\")\"))","Dropdown-Text 2021","Angebotsnummer"]
[{"$f":"B2&\" : \"&J2","v":"A-01-001 : Kompetenzerfassung (WTL Kompetenzerfassung)"},"A-01-001","Kompetenzerfassung","WTL Kompetenzerfassung","WTL Werk- und Technologiezentrum Linthgebiet","published","2021-01-01","2099-12-31","2022-09-19",{"$f":"_xlfn.TEXTJOIN(\" \",TRUE,C2,IF(ISBLANK(D2),\"\",\"(\"&SUBSTITUTE(D2,\"---\n- \",\"\")&\")\"))","v":"Kompetenzerfassung (WTL Kompetenzerfassung)"},"A-01-001 : WTL Kompetenzerfassung (WTL Werkund Technologiezentrum Linthgebiet)","A-01-001"]
[{"$f":"B3&\" : \"&J3","v":"A-01-002 : Kompetenzerfassung (Portal 44)"},"A-01-002","Kompetenzerfassung","Portal 44","Plattform Glattal","published","2021-01-01","2099-12-31","2020-12-21",{"$f":"_xlfn.TEXTJOIN(\" \",TRUE,C3,IF(ISBLANK(D3),\"\",\"(\"&SUBSTITUTE(D3,\"---\n- \",\"\")&\")\"))","v":"Kompetenzerfassung (Portal 44)"},"A-01-002 : Portal 44 (Plattform Glattal)","A-01-002"]
["A-01-003 : Kompetenzerfassung (HEKS MosaiQ Kompetenzabklärung)","A-01-003","Kompetenzerfassung","HEKS MosaiQ Kompetenzabklärung","HEKS Regionalstelle Zürich/Schaffhausen","published","2021-01-01","2099-12-31","2020-12-21","Kompetenzerfassung (HEKS MosaiQ Kompetenzabklärung)","A-01-003 : HEKS MosaiQ Kompetenzabklärung (HEKS Regionalstelle Zürich/Schaffhausen)","A-01-003"]
["A-01-005 : Kompetenzerfassung (AOZ Kompetenzerfassung)","A-01-005","Kompetenzerfassung","AOZ Kompetenzerfassung","Asyl-Organisation Zürich (AOZ)","published","2021-01-01","2099-12-31","2020-12-21","Kompetenzerfassung (AOZ Kompetenzerfassung)","A-01-005 : AOZ Kompetenzerfassung (Asyl-Organisation Zürich (AOZ))","A-01-005"]
["A-01-006 : Kompetenzerfassung (Kompetenzerfassung Stiftung Chance)","A-01-006","Kompetenzerfassung","Kompetenzerfassung Stiftung Chance","Stiftung Chance","published","2021-01-01","2099-12-31","2020-12-21","Kompetenzerfassung (Kompetenzerfassung Stiftung Chance)","A-01-006 : Kompetenzerfassung Stiftung Chance (Stiftung Chance)","A-01-006"]
["A-01-007 : Kompetenzerfassung (procomo Kompetenzerfassung)","A-01-007","Kompetenzerfassung","procomo Kompetenzerfassung","Förderverein cocomo","published","2021-01-01","2099-12-31","2020-12-21","Kompetenzerfassung (procomo Kompetenzerfassung)","A-01-007 : procomo Kompetenzerfassung (Förderverein cocomo)","A-01-007"]
["A-01-008 : Kompetenzerfassung (Prospectiva Eignungsabklärung)","A-01-008","Kompetenzerfassung","Prospectiva Eignungsabklärung","Soziale Unternehmungen Zürich SUZ","published","2021-01-01","2099-12-31","2020-12-21","Kompetenzerfassung (Prospectiva Eignungsabklärung)","A-01-008 : Prospectiva Eignungsabklärung (Soziale Unternehmungen Zürich SUZ)","A-01-008"]
{"$rows_left_out":249}
{"sheet":"Gemeinden","index":6,"n_rows":2173,"n_cols":7,"rows_kept":2173,"cut":false,"hidden":true,"merged":[]}
["Hist.-Nummer","Kanton","Bezirks-nummer","Bezirksname","BFS Gde-nummer","Gemeindename","Datum der Aufnahme"]
[11735,"ZH",102,"Andelfingen",21,"Adlikon","1872-01-01"]
[11745,"ZH",106,"Horgen",131,"Adliswil","1893-01-01"]
[14365,"ZH",111,"Dietikon",241,"Aesch (ZH)","2003-01-01"]
[13256,"ZH",101,"Affoltern",1,"Aeugst am Albis","1976-11-15"]
[11742,"ZH",101,"Affoltern",2,"Affoltern am Albis","1848-09-12"]
[11777,"ZH",110,"Winterthur",211,"Altikon","1848-09-12"]
[13214,"ZH",102,"Andelfingen",30,"Andelfingen","1970-01-01"]
{"$rows_left_out":2166}
{"sheet":"SLT-Leistungsklasse","index":7,"n_rows":294,"n_cols":10,"rows_kept":294,"cut":false,"hidden":true,"merged":[]}
["Dropdown-Text","SL-Träger-ID","SLTNAME","GEMEINDE_ID","Gemeinde","Asylsuchende","Flüchtlinge","Sort","Ausgeblendet","Neu 2022"]
["14288 : Adlikon (Fürsorgebehörde Andelfingen)",14288,"Fürsorgebehörde Andelfingen",21,"Adlikon",null,"x",55,"","×"]
["13006 : Stadt Adliswil",13006,"Stadt Adliswil",131,"Adliswil","x","x",284,"",""]
["11286 : Gemeindeverwaltung Aesch",11286,"Gemeindeverwaltung Aesch",241,"Aesch (ZH)",null,"x",98,"",""]
["11088 : Affoltern am Albis (Gemeindeverwaltung Affoltern am Albis)",11088,"Gemeindeverwaltung Affoltern am Albis",2,"Affoltern am Albis",null,"x",101,"","×"]
["11059 : Altikon (Gemeindeverwaltung Seuzach)",11059,"Gemeindeverwaltung Seuzach",211,"Altikon","x","x",159,"",""]
["14288 : Andelfingen (Fürsorgebehörde Andelfingen)",14288,"Fürsorgebehörde Andelfingen",30,"Andelfingen",null,"x",56,"","×"]
["11009 : Gemeinde Bachenbülach",11009,"Gemeinde Bachenbülach",51,"Bachenbülach","x","x",59,"",""]
{"$rows_left_out":286}